program: Gaussian 09
title: 000221160
version: EM64L-G09RevD.01
frameworkgroup: C1[X(C8H11N5)]
method: RPBEPBE
basis: SDD
operation: Freq
keyword: #pfreq=noraman
keyword: PBEPBE/SDD
title: #p freq=noraman PBEPBE/SDD
converged: YES YES NO NO
title: Mulliken charges:
elementType: N N N N N C C C C C C C C H H H H H H H H H H H
charge: -0.378717 -0.383770 -0.094649 -0.036154 -0.003476 -0.025686 0.231127 0.018620 -0.716846 -0.672316 0.104593 -0.413758 -0.360502 0.251839 0.305198 0.228508 0.201621 0.234057 0.256555 0.211577 0.198227 0.257843 0.342510 0.243600
chargesum: 0.00000
title: Mulliken charges with hydrogens summed into heavy atoms:
elementType: N N N N N C C C C C C C C
charge: -0.073519 -0.041261 -0.094649 -0.036154 -0.003476 0.226153 0.231127 0.018620 -0.052659 -0.005958 0.104593 -0.155915 -0.116902
polarizability: 1.69198945e+02 1.34635891e+00 1.29276588e+02 -1.56305713e+00 -3.79552818e+00 6.74958615e+01
1716.lowfreq: -12.4400 -4.0502 0.0003 0.0006 0.0007 3.2404 37.1040 63.3722 116.3938
frequency: 36.8318 63.3685 116.3902 140.6290 211.9444 215.0913 242.1836 250.8608 289.2025 338.8181 398.1759 438.1490 478.7205 497.6445 525.6380 543.1970 614.7712 644.3381 658.3310 669.6899 741.2193 788.9463 827.4950 830.2255 860.2779 909.3736 919.8059 936.1046 942.2729 952.1248 1033.5360 1056.1169 1136.6661 1146.9946 1173.0834 1182.2682 1220.8223 1269.1088 1300.5127 1319.9059 1338.7277 1345.1417 1355.7864 1376.1946 1384.4691 1395.8044 1404.5551 1441.9377 1460.7112 1468.6191 1476.8093 1486.2001 1492.1426 1553.6812 1593.8000 2974.4737 2981.5534 3034.2298 3068.6408 3081.1513 3094.3047 3098.9448 3160.2672 3212.2234 3557.4444 3620.0658
redmass: 2.8922 4.0288 3.9108 4.2076 1.1095 4.4570 1.1330 3.4352 5.5266 2.8452 2.6014 2.2620 1.3912 3.7872 8.5212 4.1201 2.2479 7.7728 1.6284 9.7567 7.4043 3.0926 2.6202 1.8182 6.3190 4.0937 1.2502 1.4411 1.6746 1.8930 3.8866 2.9289 2.3500 3.7092 2.1118 2.4799 1.8667 2.7977 1.4935 3.2884 2.7259 1.4262 3.0172 1.2102 3.3944 1.2460 1.6289 2.0279 1.0834 1.0557 1.2683 1.0478 2.1604 6.1953 6.4133 1.0384 1.0362 1.0854 1.0978 1.0986 1.0994 1.0999 1.0920 1.0974 1.0772 1.0824
irintensity: 0.3906 0.5888 0.4755 1.0531 0.1810 0.7934 0.4711 2.7512 0.2036 2.2637 1.3376 6.0162 90.2540 6.5121 0.2687 0.9382 38.0929 4.2000 80.9165 7.9832 1.7107 32.6962 5.9852 14.4693 22.3758 43.2408 6.8660 10.7183 2.1737 1.4061 9.2417 0.1026 18.1986 23.5844 11.5713 82.2836 1.0381 35.3745 1.4631 95.1250 29.7103 1.7649 20.4458 25.0692 37.6929 18.9392 6.4199 34.1588 9.5258 6.5159 26.4076 20.0180 16.8084 189.1718 559.1709 25.9421 33.0052 0.3430 12.4511 59.8643 29.6768 28.5303 19.8259 2.9753 43.9743 97.7344
temp: 298.150 k
press: 1.00000 atm
elementType: 7 7 7 7 7 6 6 6 6 6 6 6 6 1 1 1 1 1 1 1 1 1 1 1
symmnumber: 1
zpe: 504696.8 jmol-1
zpe.correction: 0.192229 hartree
zpe.thermalcorrener: 0.203873 hartree
zpe.thermalcorrenthalpy: 0.204818 hartree
zpe.thermalcorrgfe: 0.154055 hartree
zpe.sumelectzpe: -584.250159 hartree
zpe.sumelectthermal: -584.238515 hartree
zpe.sumelectthermalent: -584.237571 hartree
zpe.sumelectthermalfe: -584.288333 hartree
dipole: 3.0076 -1.9623 0.1094
dipole: 3.5928
quadrupole: -70.4296 -79.4969 -79.0351
quadrupole: -5.2479 -0.2553 0.3021
quadrupole: 5.8909 -3.1764 -2.7145 -5.2479 -0.2553 0.3021
hfenergy: -584.4423881 hartree
pointgroup: C01 [X(C8H11N5)]
dipole: -1.1774824 -0.7799265 -0.0571723 debye
dipolederiv: -1.5268815 -0.3024863 -0.0677111 -0.7552593 -0.4134433 0.084571 0.0399418 0.1175429 -0.4875652 -0.3954937 0.1831033 0.0200772 -0.1679221 -0.3267823 0.000168 -0.0094625 -0.0127909 -0.2529516 -0.8249182 -0.1048535 -0.0025147 -0.821439 -0.8155335 -0.0600762 -0.0897262 -0.0625627 -0.2288877 -0.8612501 0.0957615 0.0170311 0.1485262 -0.6472826 -0.0531227 0.0447989 -0.0471762 -0.2075925 -0.2959708 0.2407598 0.0182236 0.539982 -0.054215 0.0012055 0.0533855 0.0065328 -0.2100681 0.8965803 -0.0034201 0.0522859 -0.2544705 0.1652107 -0.0764975 -0.08101 -0.113685 0.3242848 1.711048 0.3556511 0.0393296 1.0332096 0.7686038 0.0521684 0.0618497 0.0436176 0.2111998 -0.8130427 -0.1384452 -0.0053772 0.0634804 -0.2577563 -0.0230426 0.0276123 -0.0218656 -0.0057611 -0.1115505 -0.0368692 0.0188247 0.0000105 0.0409979 0.0796962 0.0253088 0.0859391 0.0340138 -0.1273926 -0.0496496 -0.0105541 0.0442095 0.03605 0.0956856 0.0102316 0.128746 -0.0900856 0.6071383 -0.2530092 -0.0344275 -0.1109152 0.4686932 0.0427449 -0.0311562 0.0421386 0.1074772 0.0474407 -0.0974426 -0.0110202 -0.1724065 0.2597152 0.0326527 -0.0202668 0.0381941 -0.1045863 1.080604 0.0397399 -0.0216098 0.2579133 0.5895051 0.0711341 -0.0138969 0.0641835 -0.0561563 0.032361 -0.0299788 -0.0320359 0.0581984 -0.0067721 -0.0672058 -0.0005175 -0.0432418 -0.0227201 0.1195705 0.0234666 -0.0079166 0.1245749 0.1262334 -0.029709 -0.0008298 -0.053381 0.2955251 -0.1597927 0.0457187 0.0261119 0.0881563 0.0475084 -0.0105797 0.003438 0.0006421 0.1099958 0.0945341 0.0189115 0.028526 -0.0502145 -0.0846315 -0.0882401 -0.0054673 -0.1480762 -0.0214926 0.1020405 0.0246922 -0.0812135 -0.0039765 0.0448527 0.0823834 -0.0488405 0.0854905 -0.1205238 0.0526338 -0.1001132 0.0758462 -0.0923476 -0.0017398 0.0706772 0.0784173 0.0458798 0.0476936 -0.183088 0.0977273 -0.0089138 0.1385115 0.0662134 -0.0017819 -0.018691 -0.0292435 0.0688374 0.0979456 0.0158985 -0.0171365 -0.0368681 -0.0737298 -0.1470435 -0.0258595 -0.0747829 -0.0282103 0.0680917 -0.0602573 -0.0022775 -0.0344 -0.0138393 -0.0160714 -0.0004382 -0.0154709 0.1696245 0.3068727 0.0089447 0.0030898 0.001707 0.1771766 -0.0162882 0.0012514 -0.0167357 0.3497776 0.0825197 0.0261499 0.0033623 0.0017396 -0.0950347 -0.0234283 -0.0000728 -0.0198948 0.1181716 unknown
polarizability: 169.2358053|-1.0999675|129.2224937|-0.6961294|4.0691781|67.5130954 unknown
InChI: InChI=1S/C8H11N5/c1-5(2)12-7-6-3-11-13-8(6)10-4-9-7/h3-5,12-13H,1-2H3
charge 0 multiplicity 1
24 atoms
N  -1.56956 -0.659495 0.062644
N  3.12826 -0.404569 -0.070541
N  -0.51074 1.44329 0.217266
N  1.930596 1.739665 0.174039
N  2.831277 -1.765657 -0.188427
C  -2.929746 -0.070733 0.13945
C  -0.413767 0.077948 0.085869
C  0.88733 -0.527162 -0.011342
C  -3.894995 -1.121391 0.722455
C  -3.389667 0.447488 -1.243629
C  1.99596 0.378727 0.039687
C  1.470509 -1.831592 -0.151887
C  0.644524 2.179773 0.257657
H  -2.854304 0.7938 0.822743
H  -1.494471 -1.668639 -0.073542
H  -4.909589 -0.69588 0.809708
H  -3.964599 -2.010573 0.064879
H  -3.571722 -1.450717 1.726136
H  -2.675858 1.197842 -1.623043
H  -4.383582 0.924804 -1.163202
H  -3.461015 -0.380047 -1.97399
H  0.99733 -2.809629 -0.228019
H  4.099669 -0.101152 -0.071766
H  0.510659 3.2603 0.368852
