program: Gaussian 09
title: 000222477
version: EM64L-G09RevD.01
frameworkgroup: C1[X(C6H12O2S)]
method: RPBEPBE
basis: SDD
operation: Freq
keyword: #p
keyword: freq=noraman
keyword: PBEPBE/SDD
title: #p freq=noraman PBEPBE/SDD
converged: NO YES NO NO
title: Mulliken charges:
elementType: S O O C C C C C C H H H H H H H H H H H H
charge: 0.150553 -0.412949 -0.236717 -0.610629 -0.339624 -0.635704 -0.445210 -0.670025 0.194654 0.246268 0.246339 0.216247 0.216236 0.264663 0.265008 0.264880 0.264881 0.210385 0.222688 0.210394 0.377660
chargesum: 0.00000
title: Mulliken charges with hydrogens summed into heavy atoms:
elementType: S O O C C C C C C
charge: 0.150553 -0.035289 -0.236717 -0.118022 0.092860 -0.106033 0.084552 -0.026557 0.194654
polarizability: 1.28448665e+02 2.41637253e+00 8.24749207e+01 -1.30651572e-02 -9.94625613e-03 5.95299318e+01
1716.lowfreq: -16.7093 -0.9115 -0.0027 -0.0026 -0.0015 4.4644 31.1921 33.2341 56.8171
frequency: 26.8693 32.9371 56.6374 61.0001 84.0126 101.2705 165.4633 216.9654 230.3923 275.2519 353.7526 443.1155 507.6308 567.0424 637.3959 705.9353 727.8326 749.1585 779.3941 859.9148 869.1792 900.7247 977.2955 1031.4770 1048.8061 1049.8870 1083.1841 1108.8953 1135.5935 1216.6318 1221.2938 1248.9839 1265.0957 1278.7542 1286.6826 1336.2259 1360.6187 1391.8240 1442.8050 1453.5016 1463.1536 1475.6512 1479.3874 1485.5464 1662.3368 2975.9073 2989.1407 2999.0287 3003.5420 3026.6782 3035.2315 3053.2717 3065.9610 3077.1351 3082.0700 3100.4111 3512.0463
redmass: 4.7331 2.5082 1.9124 5.0722 2.9443 2.6260 5.0134 5.8906 1.1001 4.0358 4.7311 4.4186 1.7737 5.3593 1.3452 4.9865 6.7052 1.0833 1.2685 1.1848 4.2328 1.9478 1.4950 3.2830 2.8050 1.1795 2.2838 2.2740 1.2189 1.4069 1.2206 1.3769 1.1387 1.4526 1.1033 1.4613 1.9028 1.2065 1.0838 1.0888 1.0936 1.0522 1.0418 1.0797 8.1449 1.0354 1.0596 1.0562 1.0608 1.0565 1.1017 1.0994 1.1050 1.0993 1.1050 1.1084 1.0640
irintensity: 2.7144 0.0043 0.3530 0.9388 0.8637 1.9792 3.9572 1.2804 0.0001 0.6955 0.0862 21.8295 33.8874 36.9040 129.9747 14.6136 4.2361 6.6557 21.2599 0.0030 0.1788 9.1429 0.5839 260.7824 0.2888 1.1168 40.5881 23.7023 0.6801 0.0389 0.6485 4.4563 0.0307 16.9399 0.1028 19.3396 95.8315 12.4064 33.8377 3.8598 5.7158 3.0631 13.6659 13.0767 203.4326 35.2850 5.3618 50.6653 12.9333 15.0164 0.3339 0.8555 0.1634 46.2005 100.0397 14.9361 23.1166
temp: 298.150 k
press: 1.00000 atm
elementType: 16 8 8 6 6 6 6 6 6 1 1 1 1 1 1 1 1 1 1 1 1
symmnumber: 1
zpe: 453240.7 jmol-1
zpe.correction: 0.172630 hartree
zpe.thermalcorrener: 0.184551 hartree
zpe.thermalcorrenthalpy: 0.185495 hartree
zpe.thermalcorrgfe: 0.131750 hartree
zpe.sumelectzpe: -783.612349 hartree
zpe.sumelectthermal: -783.600428 hartree
zpe.sumelectthermalent: -783.599484 hartree
zpe.sumelectthermalfe: -783.653229 hartree
dipole: 0.4002 0.2127 0.0099
dipole: 0.4533
quadrupole: -51.0811 -69.8870 -62.4082
quadrupole: 4.2567 -0.0064 0.0223
quadrupole: 10.0443 -8.7615 -1.2828 4.2567 -0.0064 0.0223
hfenergy: -783.7849793 hartree
pointgroup: C01 [X(C6H12O2S1)]
dipole: 0.1571339 -0.0842739 -0.0044082 debye
dipolederiv: -0.3728624 0.0432235 0.0003582 0.0466474 -0.0440782 0.0018579 0.000316 0.0015533 -0.2090587 -1.1931394 0.4987094 0.0001445 0.4373074 -0.5158615 0.0007949 -0.000098 0.0006058 -0.4316391 -0.7357501 -0.120931 -0.0014251 0.1125304 -0.9567803 -0.0026328 -0.0007076 -0.0028131 -0.305937 0.2798378 -0.1758082 -0.0017569 -0.2639136 0.1080847 -0.0010515 -0.00264 -0.0008383 0.1812491 0.0108492 0.001773 -0.0000546 0.2269312 0.0485528 -0.0008711 0.002246 -0.0009812 0.1501702 0.276764 0.1340429 0.0014444 0.2336668 0.0464812 -0.0007697 0.0025874 -0.0005595 0.1597688 -0.2552972 -0.0768104 -0.0012964 -0.4555345 -0.1530026 -0.0027774 -0.0053186 -0.0024728 0.1315952 -0.1035045 0.0639869 0.0005453 -0.046555 0.0616849 -0.0004618 -0.0005415 -0.000398 0.1043307 1.6328605 -0.1771892 0.0030748 -0.2228051 1.3275654 0.0043699 0.0035703 0.004741 0.2001188 -0.021484 0.02034 -0.0170246 0.0544882 -0.0571098 -0.1060526 -0.0188787 -0.1130996 -0.0603819 -0.02154 0.0200536 0.0173022 0.0541139 -0.0616444 0.1061178 0.0198878 0.1130547 -0.0557757 0.0570952 0.0188432 -0.0030383 -0.0229279 -0.0226488 0.1140854 0.0229786 0.1262869 -0.0637253 0.0571419 0.0188716 0.0035294 -0.02238 -0.0178031 -0.1131735 -0.0233331 -0.1253615 -0.0685887 -0.0105422 -0.0246217 0.0063693 -0.0387594 -0.0209629 -0.0965373 -0.0028933 -0.0910246 -0.0395353 -0.0102031 -0.025144 -0.0064892 -0.0390656 -0.0242595 0.0965184 0.00222 0.0908123 -0.0355771 0.09546 -0.0129411 0.0130086 0.0564544 0.0605373 -0.0759683 0.0347665 -0.0827644 0.005394 0.095347 -0.0126179 -0.0130142 0.0570177 0.0579027 0.0771875 -0.0331172 0.0837981 0.0077983 0.0922172 -0.0148215 -0.0388238 0.0369 -0.0145481 -0.1167671 0.0068151 -0.1349999 -0.0877928 -0.2059748 -0.0660775 -0.0008197 -0.0930794 0.0331883 -0.0007813 -0.0010769 -0.0007729 0.1061018 0.0922168 -0.0157377 0.0386756 0.0369129 -0.0196897 0.1181835 -0.0059056 0.1363611 -0.0826077 0.2405081 -0.097144 -0.0007095 -0.1479497 0.1643916 -0.001271 -0.0008772 -0.0011274 0.3940924 unknown
polarizability: 128.4287844|-2.5982384|82.4935126|0.0629328|0.1658507|59.5312205 unknown
InChI: InChI=1S/C6H12O2S/c1-2-4-9-5-3-6(7)8/h7H,2-5H2,1H3
charge 0 multiplicity 1
21 atoms
S  1.026104 0.995247 0.010024
O  -4.14836 0.624708 -0.006694
O  -3.055666 -1.425883 -0.012204
C  2.401612 -0.309191 -0.002936
C  3.77648 0.385128 0.004516
C  -0.463283 -0.168729 -0.004394
C  -1.742595 0.680534 0.000502
C  4.934508 -0.638522 -0.005434
C  -2.99456 -0.176294 -0.007472
H  2.276368 -0.9294 -0.909117
H  2.275903 -0.947853 0.890257
H  3.855261 1.049294 -0.8777
H  3.854726 1.031318 0.900033
H  -0.414507 -0.801558 -0.906114
H  -0.418988 -0.818373 0.885497
H  -1.780028 1.338657 0.889632
H  -1.77793 1.352805 -0.877953
H  4.893808 -1.279627 -0.906024
H  5.912961 -0.124802 0.000216
H  4.89303 -1.297823 0.881886
H  -4.952844 0.037262 -0.010721
