program: Gaussian 09
title: 000222480
version: EM64L-G09RevD.01
frameworkgroup: C1[X(C8H16O2S)]
method: RPBEPBE
basis: SDD
operation: Freq
keyword: #p
keyword: freq=noraman
keyword: PBEPBE/SDD
title: #p freq=noraman PBEPBE/SDD
converged: YES YES NO NO
title: Mulliken charges:
elementType: S O O C C C C C C C C H H H H H H H H H H H H H H H H
charge: 0.151996 -0.412610 -0.236187 -0.336664 -0.334250 -0.350805 -0.662651 -0.692290 -0.633486 -0.446337 0.193811 0.186858 0.186943 0.209474 0.209298 0.196108 0.196010 0.251368 0.250967 0.264111 0.264285 0.209848 0.209847 0.217471 0.264602 0.264639 0.377645
chargesum: 0.00000
title: Mulliken charges with hydrogens summed into heavy atoms:
elementType: S O O C C C C C C C C
charge: 0.151996 -0.034965 -0.236187 0.037137 0.084522 0.041314 -0.160317 -0.055123 -0.105090 0.082903 0.193811
polarizability: 1.62329134e+02 -1.56326785e+00 1.00658390e+02 -7.39803607e-02 2.07793526e-02 7.68290196e+01
1716.lowfreq: -10.0828 -0.0014 -0.0013 0.0014 3.4229 5.7975 19.7763 25.8522 41.5468
frequency: 19.6525 25.7827 41.4912 50.2066 62.1714 84.2955 103.1237 115.8992 136.1242 183.9943 195.1672 231.5585 283.6596 355.7448 424.4498 453.2816 506.8290 566.9950 636.8561 702.5622 726.0151 730.4168 756.1808 779.8970 832.8525 870.4824 896.0155 946.2944 979.4803 1005.1011 1033.7284 1058.4593 1060.5128 1072.7299 1089.1716 1113.8714 1135.7649 1195.4015 1214.5548 1237.2703 1251.5073 1265.6814 1266.8897 1287.2901 1289.4260 1293.2918 1336.3687 1353.3862 1361.6945 1392.5776 1443.3533 1452.7093 1463.0909 1467.2136 1470.8918 1478.5293 1480.4692 1488.5729 1666.2206 2957.8984 2969.7748 2973.6676 2980.1865 2997.8000 2998.4222 3002.1331 3021.3239 3026.3341 3040.4183 3051.0393 3069.7987 3072.7684 3074.6480 3100.0611 3514.3954
redmass: 5.5510 2.6954 5.6277 1.8812 3.1606 2.9279 1.8551 4.2205 2.1780 5.1697 5.1709 1.1198 6.0909 3.8259 3.4295 3.9032 1.7780 5.3485 1.3436 5.9479 6.8093 1.0680 1.1137 1.2652 1.1967 4.1588 1.8261 1.2075 1.4889 4.2268 3.2240 2.9565 1.1250 2.3949 2.3607 2.3720 1.2167 1.6170 1.2145 1.3179 1.2784 1.1445 1.4563 1.3580 1.0518 1.1316 1.4250 1.6199 1.9084 1.2172 1.0836 1.0899 1.0928 1.0670 1.0739 1.0419 1.0705 1.0899 8.2318 1.0587 1.0589 1.0368 1.0592 1.0989 1.0557 1.0609 1.1024 1.0565 1.1046 1.0992 1.1019 1.0993 1.1076 1.1084 1.0640
irintensity: 0.6798 1.7283 0.2985 0.3572 0.2620 2.4573 0.0034 2.5267 0.3284 0.5331 2.3725 0.0001 0.0617 1.8183 9.8609 12.1936 33.4323 38.4767 130.3030 16.6156 5.0893 12.0554 0.0272 16.0108 5.4665 0.5242 3.2982 0.0112 0.4584 0.9385 260.7908 16.7116 0.5247 0.2967 32.6470 22.0531 0.6183 0.0588 0.0710 1.4463 0.0489 0.0485 0.7037 26.6962 0.4229 0.2708 25.1678 3.8482 94.8880 11.6855 33.9194 3.7194 5.4580 0.7022 0.9572 12.7076 1.9411 19.6384 203.6054 5.9676 38.2738 36.4651 37.1400 0.5959 50.4178 13.7526 5.9264 14.7461 28.1549 0.8403 35.3654 52.6468 112.3514 15.6114 23.2095
temp: 298.150 k
press: 1.00000 atm
elementType: 16 8 8 6 6 6 6 6 6 6 6 1 1 1 1 1 1 1 1 1 1 1 1 1 1 1 1
symmnumber: 1
zpe: 599771.0 jmol-1
zpe.correction: 0.228441 hartree
zpe.thermalcorrener: 0.243164 hartree
zpe.thermalcorrenthalpy: 0.244109 hartree
zpe.thermalcorrgfe: 0.182817 hartree
zpe.sumelectzpe: -862.058457 hartree
zpe.sumelectthermal: -862.043734 hartree
zpe.sumelectthermalent: -862.042790 hartree
zpe.sumelectthermalfe: -862.104081 hartree
dipole: -0.5051 0.1797 -0.0085
dipole: 0.5362
quadrupole: -64.3247 -83.5147 -75.1656
quadrupole: -3.0454 -0.0263 -0.0145
quadrupole: 10.0103 -9.1797 -0.8306 -3.0454 -0.0263 -0.0145
hfenergy: -862.2868981 hartree
pointgroup: C01[X(C8H16O2S1)]
dipole: 0.1979511 0.0727083 0.0048897 debye
polarizability: 162.2875324|2.2325289|100.6820675|-0.2234663|0.6379868|76.8469442 unknown
InChI: InChI=1S/C8H16O2S/c1-2-3-4-6-11-7-5-8(9)10/h9H,2-7H2,1H3
charge 0 multiplicity 1
27 atoms
S  -0.277921 -1.079144 -0.034215
O  -5.434423 -0.51551 0.008692
O  -4.268153 1.492481 0.054387
C  3.693096 0.418567 0.001007
C  2.492732 -0.558078 -0.016104
C  5.056677 -0.310815 -0.007532
C  1.142995 0.178676 -0.003433
C  6.25638 0.660727 0.006283
C  -1.724346 0.13944 0.009922
C  -3.034672 -0.659197 -0.007759
C  -4.253522 0.242655 0.022095
H  3.631881 1.067202 0.899669
H  3.635081 1.094096 -0.877803
H  2.552816 -1.232329 0.86137
H  2.553545 -1.201127 -0.916728
H  5.113824 -0.985182 0.870997
H  5.115378 -0.961491 -0.903666
H  1.036898 0.830925 -0.889131
H  1.032386 0.791218 0.909685
H  -1.646939 0.750585 0.9245
H  -1.656422 0.805063 -0.866551
H  6.238818 1.32546 -0.878039
H  6.237403 1.302184 0.907615
H  7.218153 0.115809 -0.000042
H  -3.098619 -1.298184 -0.909411
H  -3.092126 -1.348668 0.856256
H  -6.218318 0.098339 0.028339
