program: Gaussian 09
title: 000222481
version: EM64L-G09RevD.01
frameworkgroup: C1[X(C8H16O2S)]
method: RPBEPBE
basis: SDD
operation: Freq
keyword: #p
keyword: freq=noraman
keyword: PBEPBE/SDD
title: #p freq=noraman PBEPBE/SDD
converged: YES YES NO NO
title: Mulliken charges:
elementType: S O O C C C C C C C C H H H H H H H H H H H H H H H H
charge: 0.125600 -0.412750 -0.236528 -0.039487 -0.333310 -0.658418 -0.702891 -0.699491 -0.638440 -0.449010 0.191532 0.217500 0.199766 0.207985 0.217438 0.233626 0.210598 0.229280 0.241973 0.260274 0.264867 0.212687 0.232572 0.218669 0.262862 0.265777 0.377319
chargesum: 0.00000
title: Mulliken charges with hydrogens summed into heavy atoms:
elementType: S O O C C C C C C C C
charge: 0.125600 -0.035432 -0.236528 -0.039487 0.083956 0.000631 -0.021040 -0.035563 -0.113299 0.079629 0.191532
polarizability: 1.44097031e+02 -1.26728808e+00 9.45196350e+01 3.65925800e+00 5.97877140e+00 9.73667112e+01
1716.lowfreq: -5.1587 -0.0013 -0.0010 0.0023 2.1190 13.8010 25.9767 32.7771 43.2431
frequency: 20.2199 32.0369 43.1879 73.2211 90.8200 122.2982 176.4365 200.6787 210.9146 219.5534 237.4553 271.2052 289.8290 323.6206 366.6756 390.9343 452.8129 472.0814 507.0565 524.3767 568.8232 639.2696 720.7656 762.0366 778.3860 790.7574 869.0342 911.8855 933.9299 975.0704 989.7134 1007.7886 1032.6412 1047.5207 1070.5517 1087.9983 1135.4070 1154.2517 1189.8587 1223.8722 1230.8189 1263.9845 1267.6772 1279.0463 1335.3565 1357.5282 1375.5041 1389.0309 1393.1177 1442.3063 1452.9403 1458.5545 1463.8843 1469.8557 1473.7335 1476.2950 1486.6608 1495.4778 1665.5070 2959.3540 2970.0297 2978.8584 2984.0094 3002.0752 3016.4056 3031.3211 3051.0835 3058.7399 3072.0727 3077.8907 3082.7279 3090.3591 3093.6966 3104.3751 3513.5492
redmass: 5.5622 3.8440 2.7289 3.0140 3.3568 2.0788 2.3346 1.2073 2.6776 2.8842 1.3711 1.3884 2.3366 2.9155 3.0383 2.6722 3.9365 2.8206 1.8013 3.7466 5.3684 1.3296 6.5950 2.0051 1.2921 1.3641 4.2068 2.0099 1.4328 1.5068 1.2652 1.4162 3.2611 1.4654 2.5887 2.4368 1.2167 2.0288 2.5767 1.2571 2.5140 1.2942 1.3619 1.3125 1.5044 1.9597 1.2131 1.2131 1.1965 1.0828 1.0578 1.0707 1.0559 1.0710 1.0533 1.0477 1.0569 1.0512 8.2073 1.0612 1.0383 1.0367 1.0361 1.0608 1.0964 1.0568 1.0990 1.0968 1.0979 1.0995 1.0999 1.0998 1.0990 1.1081 1.0640
irintensity: 1.2448 0.0229 0.6664 0.9183 1.9633 1.4501 1.3736 0.5622 1.8961 0.7691 0.6182 0.0788 0.7020 0.2016 0.3197 1.2090 23.3053 0.7211 30.7023 8.2894 39.9265 130.8067 12.0507 1.9329 13.2165 14.0112 0.8212 1.1437 1.3203 0.4130 1.8566 22.5442 251.7459 12.0760 1.0158 49.5013 1.0809 48.4160 8.5735 9.3881 5.0136 3.7097 4.0907 16.5274 6.2930 99.9234 16.1576 33.8663 12.5369 30.5480 1.8872 10.9494 1.8395 3.5085 9.0454 12.1966 26.3089 0.7752 197.8054 21.2485 42.5621 34.0403 31.2658 14.5107 15.5393 15.4228 1.3293 30.2804 26.2680 34.1399 45.3880 26.3991 28.4109 18.0989 22.9498
temp: 298.150 k
press: 1.00000 atm
elementType: 16 8 8 6 6 6 6 6 6 6 6 1 1 1 1 1 1 1 1 1 1 1 1 1 1 1 1
symmnumber: 1
zpe: 596809.8 jmol-1
zpe.correction: 0.227313 hartree
zpe.thermalcorrener: 0.241904 hartree
zpe.thermalcorrenthalpy: 0.242848 hartree
zpe.thermalcorrgfe: 0.183906 hartree
zpe.sumelectzpe: -862.062144 hartree
zpe.sumelectthermal: -862.047553 hartree
zpe.sumelectthermalent: -862.046609 hartree
zpe.sumelectthermalfe: -862.105551 hartree
dipole: 0.4938 -0.0005 0.3256
dipole: 0.5915
quadrupole: -64.4783 -78.0432 -80.5206
quadrupole: 1.3831 3.8236 -3.5763
quadrupole: 9.8691 -3.6958 -6.1732 1.3831 3.8236 -3.5763
hfenergy: -862.2894571 hartree
pointgroup: C01 [X(C8H16O2S1)]
dipole: 0.1915967 -0.0385737 0.1263276 debye
polarizability: 143.8971917|-3.0756561|91.6302144|3.9709285|4.2023788|100.4559706 unknown
InChI: InChI=1S/C8H16O2S/c1-4-8(2,3)11-6-5-7(9)10/h9H,4-6H2,1-3H3
charge 0 multiplicity 1
27 atoms
S  0.725467 -0.536405 -1.075008
O  -4.413412 -0.061827 -0.727844
O  -3.289424 0.532341 1.215865
C  2.233454 -0.445998 0.14665
C  2.322286 0.952744 0.816025
C  2.079413 -1.544294 1.221045
C  3.451799 -0.742919 -0.755953
C  2.484746 2.155711 -0.135211
C  -0.721816 -0.02549 0.028649
C  -2.01725 -0.255962 -0.763631
C  -3.250081 0.11879 0.03644
H  1.424575 1.100559 1.44835
H  3.182717 0.918352 1.518198
H  2.969988 -1.551872 1.880699
H  1.195103 -1.370841 1.860739
H  1.980803 -2.54003 0.755748
H  4.379352 -0.693451 -0.153565
H  3.38038 -1.755091 -1.193117
H  3.53704 -0.017694 -1.583099
H  -0.717099 -0.634473 0.947045
H  -0.617435 1.035965 0.305756
H  2.443959 3.10389 0.431386
H  1.679412 2.165634 -0.891863
H  3.450763 2.128067 -0.670501
H  -2.022156 0.328634 -1.703496
H  -2.110858 -1.316144 -1.068218
H  -5.207328 0.184505 -0.179488
