program: Gaussian 09
title: 000222470
version: EM64L-G09RevD.01
frameworkgroup: C1[X(C12H22O2)]
method: RPBEPBE
basis: SDD
operation: Freq
keyword: #pfreq=noraman
keyword: PBEPBE/SDD
title: #p freq=noraman PBEPBE/SDD
converged: YES YES NO NO
title: Mulliken charges:
elementType: O O C C C C C C C C C C C C H H H H H H H H H H H H H H H H H H H H H H
charge: -0.418983 -0.238572 -0.030561 -0.122045 -0.438992 -0.464742 -0.409384 -0.407662 -0.384063 -0.457150 -0.361296 0.120228 -0.356283 -0.699523 0.196132 0.230800 0.205523 0.202634 0.214145 0.228391 0.198365 0.191161 0.187026 0.200501 0.197553 0.191750 0.233402 0.197862 0.206143 0.187018 0.201655 0.192548 0.216325 0.212699 0.209526 0.367871
chargesum: 0.00000
title: Mulliken charges with hydrogens summed into heavy atoms:
elementType: O O C C C C C C C C C C C C
charge: -0.051112 -0.238572 0.165571 0.108755 -0.030835 -0.022206 -0.019859 -0.020135 0.005241 -0.025887 0.031866 0.120228 0.037919 -0.060974
polarizability: 1.52981304e+02 -1.35364997e+00 1.27003569e+02 -1.50951493e+00 -2.73442384e+00 1.16910464e+02
1716.lowfreq: -8.7269 0.0005 0.0006 0.0010 8.0442 11.7669 41.2722 45.6292 54.8592
frequency: 40.4426 45.4252 54.6348 61.3757 86.9736 98.8625 120.7624 165.9693 185.7878 221.2892 225.9707 246.9140 255.8509 302.6936 327.6148 394.6289 425.7919 430.9603 451.2652 497.6295 536.1251 603.6966 652.0198 724.3805 737.9143 767.5089 777.0987 785.6260 820.6361 842.6590 880.7382 892.7382 895.3094 911.9089 943.1693 961.5275 1008.0372 1033.1184 1037.7784 1050.3546 1058.0060 1063.5117 1069.9353 1081.5265 1111.7696 1117.4341 1129.9034 1140.5452 1179.4531 1211.7719 1223.8084 1241.8052 1243.8208 1260.8949 1267.8590 1276.4735 1279.4159 1287.5211 1295.3285 1313.7485 1334.0985 1335.2418 1341.2182 1345.0871 1346.0364 1356.3784 1357.5014 1381.3827 1390.1702 1457.7005 1458.5188 1463.2733 1464.4691 1465.3804 1472.1634 1475.6333 1477.3042 1479.9473 1486.4983 1651.8271 2936.9318 2955.8037 2962.4632 2964.9522 2966.1440 2967.1414 2968.8810 2972.7900 2976.3428 2984.7242 2996.9002 3006.2341 3022.4552 3023.6968 3026.7390 3029.6411 3037.8928 3048.5531 3051.2035 3069.2755 3071.8937 3493.1721
redmass: 5.6323 3.1185 3.5832 1.7537 3.3320 3.9636 2.4599 2.9412 3.3895 1.8082 1.2215 3.3728 2.4933 4.3287 1.8299 3.0012 3.0959 2.7810 2.1738 2.5290 2.2207 2.2630 1.6031 1.4126 1.7630 4.1697 1.5800 1.5321 1.7091 2.1975 1.6131 1.6901 1.7065 1.8678 1.4416 2.3841 4.0054 2.7434 1.9121 1.7507 1.6418 1.5651 1.6079 1.8757 2.3807 2.0348 2.0576 2.2740 1.5704 1.4552 1.3512 1.2784 1.4495 1.2882 1.3518 1.2630 1.2284 1.2093 1.0750 1.3072 1.3737 1.3664 1.4909 1.4375 1.4800 1.5953 1.4819 1.6206 1.2176 1.0762 1.0930 1.0881 1.0893 1.0771 1.0838 1.0670 1.0456 1.0951 1.0800 7.7621 1.0824 1.0588 1.0631 1.0602 1.0598 1.0618 1.0647 1.0363 1.0627 1.0614 1.0965 1.0853 1.1003 1.0984 1.0957 1.1005 1.1034 1.1027 1.1015 1.1007 1.0993 1.0637
irintensity: 1.3202 0.1238 0.5728 0.0885 0.1298 0.7107 0.0793 0.0152 0.2749 0.0564 0.2209 0.1696 1.8191 1.7239 0.2380 1.7424 2.5927 1.3347 2.7805 10.2492 25.5539 44.3352 96.0815 14.1009 6.4592 4.5717 0.6708 0.2887 0.3233 7.0858 3.5014 12.1705 3.1812 1.2732 3.0204 4.1962 30.8750 161.3623 38.2840 0.1049 4.4709 38.9034 5.7182 4.1579 0.6448 18.4723 8.2640 1.4581 3.5572 2.1061 2.7356 3.8553 3.2865 2.3438 3.9882 3.5948 3.2360 0.1084 1.8485 1.4742 1.1534 0.0557 4.0064 0.3080 1.8121 0.8874 10.0675 13.8438 10.6473 3.8473 3.5626 4.2723 11.6100 0.6482 19.0155 6.3568 11.9238 2.3580 16.2475 163.1029 15.6112 4.9084 41.2148 40.9164 38.4965 19.0289 32.3727 40.2405 57.5732 19.7312 2.5420 9.8503 49.5233 54.4914 70.4261 3.5828 36.0836 121.2289 20.9600 89.1823 52.4991 17.2091
temp: 298.150 k
press: 1.00000 atm
elementType: 8 8 6 6 6 6 6 6 6 6 6 6 6 6 1 1 1 1 1 1 1 1 1 1 1 1 1 1 1 1 1 1 1 1 1 1
symmnumber: 1
zpe: 839966.2 jmol-1
zpe.correction: 0.319926 hartree
zpe.thermalcorrener: 0.335708 hartree
zpe.thermalcorrenthalpy: 0.336652 hartree
zpe.thermalcorrgfe: 0.275825 hartree
zpe.sumelectzpe: -619.801373 hartree
zpe.sumelectthermal: -619.785591 hartree
zpe.sumelectthermalent: -619.784646 hartree
zpe.sumelectthermalfe: -619.845473 hartree
dipole: 0.2818 -0.2678 -1.4080
dipole: 1.4607
quadrupole: -86.3413 -82.3591 -92.7980
quadrupole: 0.6680 0.7203 1.0804
quadrupole: 0.8248 4.8070 -5.6319 0.6680 0.7203 1.0804
hfenergy: -620.1212989 hartree
pointgroup: C01 [X(C12H22O2)]
dipole: 0.1141308 0.1124047 0.5518924 debye
polarizability: 152.961875|1.709088|126.9920034|1.2198927|-2.8276777|116.9414585 unknown
InChI: InChI=1S/C12H22O2/c1-2-3-9-11(12(13)14)10-7-5-4-6-8-10/h10-11,13H,2-9H2,1H3
charge 0 multiplicity 1
36 atoms
O  -0.270358 -2.733251 0.236187
O  -0.433569 -1.519789 -1.72918
C  1.084122 0.363663 0.453723
C  -0.333862 -0.315934 0.443595
C  2.187958 -0.602195 0.959587
C  1.499285 0.995455 -0.900031
C  3.554988 0.11185 1.080345
C  2.868721 1.709704 -0.784999
C  3.969379 0.755372 -0.264327
C  -1.468794 0.668768 0.05368
C  -2.882117 0.134382 0.376297
C  -0.355122 -1.524558 -0.478579
C  -3.998868 1.135926 0.003807
C  -5.411766 0.614079 0.342081
H  0.999344 1.190356 1.194635
H  -0.516663 -0.692178 1.468908
H  2.287801 -1.450044 0.250998
H  1.891883 -1.038885 1.9337
H  0.732696 1.717342 -1.239285
H  1.554178 0.20605 -1.675126
H  4.327915 -0.606147 1.417194
H  3.490696 0.900717 1.858701
H  2.775633 2.569208 -0.088221
H  3.157585 2.126613 -1.769317
H  4.926889 1.300063 -0.15051
H  4.141439 -0.045187 -1.013288
H  -1.401749 0.894431 -1.027356
H  -1.303091 1.62108 0.597565
H  -3.055042 -0.816719 -0.168489
H  -2.951027 -0.106575 1.45782
H  -3.9356 1.362406 -1.07986
H  -3.820324 2.094601 0.533037
H  -6.191585 1.347115 0.065396
H  -5.626385 -0.32714 -0.198308
H  -5.509883 0.408103 1.424735
H  -0.271204 -3.490883 -0.411813
