program: Gaussian 09
title: 000222464
version: EM64L-G09RevD.01
frameworkgroup: C1[X(C12H15NO2)]
method: RPBEPBE
basis: SDD
operation: Freq
keyword: #p
keyword: freq=noraman
keyword: PBEPBE/SDD
title: #p freq=noraman PBEPBE/SDD
converged: YES YES NO NO
title: Mulliken charges:
elementType: O O N C C C C C C C C C C C C H H H H H H H H H H H H H H H
charge: -0.256115 -0.252061 -0.458086 0.308247 0.275386 0.470519 -0.535005 -0.344911 -0.443371 -0.836834 0.178670 -0.629814 -0.815839 0.281094 -0.769058 0.230855 0.302447 0.385066 0.229756 0.242488 0.231654 0.233873 0.270053 0.263385 0.226812 0.224714 0.228252 0.251063 0.261087 0.245672
chargesum: 0.00000
title: Mulliken charges with hydrogens summed into heavy atoms:
elementType: O O N C C C C C C C C C C C C
charge: -0.256115 -0.252061 -0.073021 0.308247 0.275386 0.470519 -0.304150 -0.042464 -0.213614 -0.128819 0.178670 -0.096376 -0.136060 0.281094 -0.011236
polarizability: 2.22049818e+02 -6.01160858e+00 1.50285548e+02 -3.40127205e+00 -1.99374425e+00 7.96493274e+01
1716.lowfreq: -14.0913 -7.7122 -2.5785 0.0002 0.0005 0.0008 5.1083 27.7921 48.4280
frequency: -12.4269 27.7007 48.3779 65.7140 84.3591 100.1535 152.4278 166.7781 179.4452 196.3104 211.4223 255.8721 288.9012 297.5300 358.1442 374.2782 437.5745 445.8089 461.6534 481.4436 536.0763 549.4539 568.2739 588.3099 663.3151 713.6296 733.9554 806.7321 822.7185 844.3867 860.5803 886.0892 891.8524 913.9320 942.7186 979.1735 980.8824 981.1173 1018.7099 1021.4932 1040.4122 1048.6947 1122.5854 1157.0217 1169.8285 1180.3250 1210.0860 1235.6648 1291.1220 1292.8979 1311.5781 1372.3536 1375.3777 1396.1806 1402.3876 1415.3582 1419.9996 1441.3480 1451.9166 1465.8468 1470.6788 1476.0232 1480.1424 1500.9108 1544.4706 1594.9896 1605.6584 1627.6342 1641.9485 2967.5340 2973.2748 2974.8103 2982.2722 3039.2483 3049.7859 3064.0325 3082.0133 3089.0279 3089.2269 3110.5001 3127.5258 3129.6613 3188.8392 3326.2701
redmass: 1.0361 3.4588 4.4683 3.2011 5.3270 3.4440 1.1820 1.9053 2.1332 4.4918 1.8429 3.7139 2.8907 4.9049 3.2481 4.6355 3.3730 3.0270 2.8654 3.6548 4.9227 3.3766 3.6092 3.6644 4.5462 5.5928 3.3799 1.9542 3.7207 1.3224 1.4739 1.3023 2.1257 3.4997 3.8814 1.5079 1.5969 1.5341 1.4936 1.7943 1.5241 1.5588 2.1965 1.4124 1.5319 2.0445 2.8018 1.9199 3.7223 1.4715 1.8517 5.0046 1.2653 1.2462 1.3003 2.8613 1.1058 1.0768 1.0537 1.4689 1.0463 1.1163 1.0537 1.8787 2.2431 5.1064 6.8126 6.4612 3.2855 1.0392 1.0373 1.0666 1.0389 1.0972 1.0976 1.0955 1.0984 1.0954 1.0931 1.0911 1.1003 1.0909 1.0942 1.0797
irintensity: 0.3371 1.0125 1.3522 9.0032 5.0021 4.6443 0.4759 4.1559 5.0369 5.8118 1.9601 1.3737 0.0156 5.4078 1.0154 0.8968 4.9574 6.8561 1.0714 19.1958 4.2744 6.9560 6.9990 10.3267 2.4800 0.2039 0.2007 20.1169 1.4060 39.1744 58.6503 1.0829 8.4260 1.1794 10.1624 8.0412 16.9586 11.6158 2.1068 18.9417 2.2718 17.0218 3.1864 37.1411 3.1212 10.4415 106.7519 16.1686 48.6432 37.8690 48.2176 26.2246 72.3760 9.6689 14.0859 0.7863 51.4203 25.0518 19.3789 68.9589 13.7599 24.5970 12.3551 60.8121 471.2445 106.9510 73.5513 6.7502 180.8198 25.7854 48.5786 1.3881 1.2993 17.4713 23.9728 7.6789 18.9012 25.7430 1.9590 27.1442 11.3197 20.5449 3.5833 222.7676
temp: 298.150 k
press: 1.00000 atm
elementType: 8 8 7 6 6 6 6 6 6 6 6 6 6 6 6 1 1 1 1 1 1 1 1 1 1 1 1 1 1 1
symmnumber: 1
zpe: 639253.0 jmol-1
zpe.correction: 0.243479 hartree
zpe.thermalcorrener: 0.258399 hartree
zpe.thermalcorrenthalpy: 0.259343 hartree
zpe.thermalcorrgfe: 0.200535 hartree
zpe.sumelectzpe: -670.392901 hartree
zpe.sumelectthermal: -670.377981 hartree
zpe.sumelectthermalent: -670.377037 hartree
zpe.sumelectthermalfe: -670.435845 hartree
dipole: 2.6121 1.9226 -0.2106
dipole: 3.2502
quadrupole: -62.3282 -97.3068 -90.1116
quadrupole: -2.7332 -0.4473 -0.3661
quadrupole: 20.9207 -14.0579 -6.8627 -2.7332 -0.4473 -0.3661
hfenergy: -670.63638 hartree
pointgroup: C01 [X(C12H15N1O2)]
dipole: 0.9570858 0.8466217 0.0487414 debye
polarizability: 220.9600801|3.1318004|146.5483878|-15.0107527|14.7133921|84.4762255 unknown
InChI: InChI=1S/C12H15NO2/c1-8-4-5-11(9(2)6-8)13-12(15)7-10(3)14/h4-6,13H,7H2,1-3H3
charge 0 multiplicity 1
30 atoms
O  1.397537 -2.108662 -0.905823
O  2.745381 1.846259 0.088729
N  0.676092 0.095623 -0.457789
C  -0.724215 -0.069475 -0.237422
C  -1.478154 1.098706 0.104576
C  -3.53562 -0.287425 0.214389
C  -2.865944 0.959368 0.321604
C  -1.371801 -1.32564 -0.349729
C  -2.761486 -1.421945 -0.12508
C  -0.810077 2.458565 0.230609
C  1.617116 -0.867975 -0.760041
C  3.05567 -0.327757 -0.986707
C  -5.031007 -0.391112 0.461612
C  3.521318 0.877267 -0.169217
C  4.958857 0.868288 0.310807
H  -3.444836 1.854612 0.584191
H  -0.781898 -2.207197 -0.607274
H  1.069494 1.042313 -0.322386
H  -3.247333 -2.400782 -0.215923
H  -0.011475 2.464678 0.997747
H  -0.346018 2.785038 -0.721005
H  -1.54692 3.227422 0.515741
H  3.12142 -0.037015 -2.057431
H  3.738812 -1.182059 -0.854129
H  -5.600418 0.277589 -0.211383
H  -5.394382 -1.420278 0.298415
H  -5.290157 -0.104553 1.498777
H  5.089182 0.077011 1.074749
H  5.226423 1.841639 0.749072
H  5.648638 0.623897 -0.518377
