program: Gaussian 09
title: 000222447
version: EM64L-G09RevD.01
frameworkgroup: C1[X(C10H8Cl2O4)]
method: RPBEPBE
basis: SDD
operation: Freq
keyword: #p
keyword: freq=noraman
keyword: PBEPBE/SDD
title: #p freq=noraman PBEPBE/SDD
converged: YES YES NO NO
title: Mulliken charges:
elementType: Cl Cl O O O O C C C C C C C C C C H H H H H H H H
charge: -0.002851 -0.002853 -0.288889 -0.288887 -0.185837 -0.185839 0.362760 0.362769 -0.285009 -0.385900 -0.385894 -0.285017 0.315285 0.315277 -0.690661 -0.690659 0.307350 0.261889 0.261889 0.307348 0.295927 0.295938 0.295931 0.295932
chargesum: 0.00000
title: Mulliken charges with hydrogens summed into heavy atoms:
elementType: Cl Cl O O O O C C C C C C C C C C
charge: -0.002851 -0.002853 -0.288889 -0.288887 -0.185837 -0.185839 0.362760 0.362769 0.022342 -0.124011 -0.124005 0.022331 0.315285 0.315277 -0.098796 -0.098796
polarizability: 2.49649312e+02 1.26817232e+01 1.26892894e+02 3.91235580e-03 5.00651170e-03 6.08750544e+01
1716.lowfreq: -0.0020 -0.0014 -0.0011 3.2081 5.4451 17.5344 18.0122 24.9658 28.4705
frequency: 18.0122 24.9067 28.4705 41.9320 45.6793 59.1773 75.6414 105.3535 181.1129 183.2087 207.3911 254.9483 284.7194 325.5299 365.0731 374.1846 417.4007 510.0349 513.1285 528.0439 533.2931 609.5156 655.1093 670.1075 686.3325 713.4352 744.9522 769.9452 798.5330 836.2667 857.0075 899.5767 901.8664 912.1014 912.2159 971.1600 982.3580 1004.3896 1082.1502 1091.8804 1120.5369 1144.7669 1152.9062 1152.9157 1160.7075 1207.9635 1281.2138 1281.3245 1300.0711 1377.4033 1415.7759 1421.2007 1421.6040 1478.3830 1581.8161 1617.0527 1679.8148 1682.0219 3059.2211 3059.2590 3134.1534 3134.1566 3168.6360 3170.6948 3213.0564 3214.7873
redmass: 11.4989 5.4360 12.1792 2.7823 4.7614 13.5989 5.0572 12.8312 10.6856 8.3349 10.3410 12.1786 11.3204 10.3735 5.1604 6.7034 3.0936 12.5509 2.7883 3.1310 2.9141 7.1352 8.1976 8.8829 7.3748 3.8443 6.8058 7.4699 7.9960 1.2564 1.5530 7.1265 6.9097 1.7816 1.7813 1.3146 1.3279 3.0211 4.2001 4.4562 1.3163 2.6904 1.1051 1.1052 1.7208 2.3760 1.3824 1.3876 1.2742 8.3574 3.0109 1.0846 1.1461 2.3868 7.2247 7.0222 10.8614 11.0551 1.0571 1.0571 1.1073 1.1073 1.0913 1.0918 1.0948 1.0955
irintensity: 4.2288 0.0000 0.2224 17.3060 0.0000 2.3898 0.0000 0.0000 0.0002 4.3873 0.7578 0.0000 3.5298 15.3027 0.0000 0.0000 0.1249 0.0022 20.1120 0.0001 1.8994 0.0000 23.3647 42.7109 0.0000 0.0000 0.0000 44.7036 0.0000 0.0000 114.3269 0.0004 116.0406 0.0001 12.4059 0.0000 1.0561 35.4544 1290.6350 0.0011 91.0876 385.3464 0.0028 0.1127 0.0000 0.0000 43.8307 0.0002 0.0000 23.4206 24.8398 0.0001 49.6899 255.2137 0.0000 0.0000 345.1856 0.0099 21.6690 0.0169 0.2814 1.6395 4.1391 0.0000 8.5073 0.0002
temp: 298.150 k
press: 1.00000 atm
elementType: 17 17 8 8 8 8 6 6 6 6 6 6 6 6 6 6 1 1 1 1 1 1 1 1
symmnumber: 1
zpe: 423523.4 jmol-1
zpe.correction: 0.161312 hartree
zpe.thermalcorrener: 0.177294 hartree
zpe.thermalcorrenthalpy: 0.178238 hartree
zpe.thermalcorrgfe: 0.112538 hartree
zpe.sumelectzpe: -1605.700333 hartree
zpe.sumelectthermal: -1605.684351 hartree
zpe.sumelectthermalent: -1605.683407 hartree
zpe.sumelectthermalfe: -1605.749107 hartree
dipole: -0.0003 0.0000 0.0055
dipole: 0.0055
quadrupole: -131.9639 -102.3234 -104.8837
quadrupole: -24.2847 -0.0198 0.0015
quadrupole: -18.9069 10.7336 8.1733 -24.2847 -0.0198 0.0015
hfenergy: -1605.861645 hartree
pointgroup: C01 [X(C10H8Cl2O4)]
dipole: -0.0001218 -0.0021624 -0.0000169 debye
dipolederiv: -0.434353 0.0003996 -0.0917577 0.0008534 -0.1269094 0.0002349 -0.1679852 0.0002844 -0.1691172 -0.4343684 0.0000052 -0.0917528 -0.0000417 -0.1269097 -0.0000135 -0.167976 -0.0000164 -0.1691094 -2.4697075 0.0002042 -0.4668484 0.0001793 -0.1769024 0.0001339 -0.6465068 0.0000912 -0.5819732 -2.4697664 0.0004983 -0.4668319 0.0006206 -0.1769019 0.0003498 -0.6464795 0.0003204 -0.5819537 -0.6561034 -0.0001216 0.0986914 -0.0000985 -0.2718513 0.0003687 -0.5356805 0.0002973 -0.8894163 -0.6561154 -0.0000066 0.0986754 0.0004662 -0.2718553 0.0003387 -0.5356867 0.0004698 -0.8894098 1.4488339 -0.0000522 0.1253946 -0.0000333 0.0855175 -0.0000107 -0.1349252 -0.0000144 0.0618977 1.4488418 -0.0001628 0.1253782 0.0001265 0.0855216 0.0000301 -0.1349304 0.0000749 0.0619025 -0.2134884 -0.0000298 -0.011351 -0.0001889 -0.1374259 -0.0000906 0.097964 -0.0000347 -0.0580534 -0.2583235 0.0000581 -0.0508659 0.000101 -0.1578448 -0.0000951 -0.107683 -0.0001113 0.0559812 -0.2583266 0.0000252 -0.0508684 -0.0000454 -0.1578441 -0.0000796 -0.1076835 -0.0000616 0.0559801 -0.2134802 0.0000397 -0.0113502 0.0000375 -0.1374273 -0.000006 0.0979673 -0.0000109 -0.0580482 2.1077433 0.0003266 0.2350277 0.0012796 0.2179032 -0.0004457 0.9852581 -0.0002571 1.2744266 2.1078008 -0.0004923 0.2350323 -0.0012757 0.2179017 -0.0007223 0.9852267 -0.0008527 1.2744089 0.3234269 -0.0011719 0.2918121 -0.0027052 0.1512711 -0.0002342 0.6051 -0.0003485 0.1335149 0.3234659 0.0000473 0.2918066 0.0001143 0.1512708 0.0000296 0.6050957 0.0000316 0.1334834 0.1415003 0.0000273 -0.0461254 0.0000266 0.183326 0.0000706 -0.0347544 0.0000548 0.0742106 0.0598303 -0.0000205 0.0606112 -0.0000055 0.1709264 0.0000784 0.0759246 0.0000682 0.0077108 0.0598292 -0.0000222 0.0606118 -0.0000572 0.170927 0.0000472 0.0759236 0.0000493 0.0077108 0.1414777 0.0000024 -0.0461281 0.0000003 0.1833263 0.0000345 -0.0347621 0.0000203 0.074207 -0.0244832 -0.0189585 -0.0724481 -0.002075 0.0314417 -0.0727065 -0.0684117 -0.0681635 0.0449823 -0.0248705 0.0193924 -0.0721348 0.0027443 0.0305497 0.0726888 -0.0682945 0.0681077 0.0458378 -0.0246359 0.0191848 -0.072302 0.0023999 0.0309991 0.0726993 -0.0683517 0.0681377 0.0454173 -0.0247278 -0.0191727 -0.0722765 -0.0024233 0.03099 -0.0727003 -0.0683487 -0.0681364 0.0454091 unknown
polarizability: 244.7379267|-0.0376426|60.8750892|27.1957199|-0.0484552|131.8042443 unknown
InChI: InChI=1S/C10H8Cl2O4/c11-5-9(13)15-7-1-2-8(4-3-7)16-10(14)6-12/h1-4H,5-6H2
charge 0 multiplicity 1
24 atoms
Cl -6.607202 0.21398 -0.910153
Cl 6.607251 0.210447 0.909964
O  -2.796732 0.210828 0.396697
O  2.796729 0.211205 -0.396733
O  -3.657015 0.211862 -1.80391
O  3.657105 0.209679 1.803838
C  -1.392777 0.21099 0.115635
C  1.392775 0.211068 -0.115656
C  -0.814132 0.21156 -1.176035
C  0.59168 0.211575 -1.276637
C  -0.591684 0.210654 1.276616
C  0.81413 0.210703 1.176015
C  -3.817418 0.211019 -0.574537
C  3.817446 0.210324 0.574452
C  -5.128084 0.209687 0.207427
C  5.128082 0.210419 -0.207563
H  -1.434884 0.212075 -2.071746
H  1.076187 0.212012 -2.257192
H  -1.076189 0.21036 2.257172
H  1.434879 0.210508 2.071726
H  -5.186558 1.105447 0.843824
H  -5.187806 -0.689861 0.83838
H  5.187127 1.108089 -0.841232
H  5.187188 -0.687228 -0.841253
