program: Gaussian 09
title: 000222385
version: EM64L-G09RevD.01
frameworkgroup: C1[X(C13H15ClO2)]
method: RPBEPBE
basis: SDD
operation: Freq
keyword: #p
keyword: freq=noraman
keyword: PBEPBE/SDD
title: #p freq=noraman PBEPBE/SDD
converged: YES YES NO NO
title: Mulliken charges:
elementType: Cl O O C C C C C C C C C C C C C H H H H H H H H H H H H H H H
charge: -0.045924 -0.311600 -0.259425 0.003221 -0.447865 -0.434859 -0.384999 -0.392067 -0.384663 0.209586 0.222647 -0.332655 -0.326844 -0.208658 -0.201272 -0.094337 0.248020 0.245255 0.202330 0.195798 0.217063 0.209878 0.200893 0.201164 0.206922 0.189996 0.203380 0.276730 0.272184 0.261266 0.258838
chargesum: 0.00000
title: Mulliken charges with hydrogens summed into heavy atoms:
elementType: Cl O O C C C C C C C C C C C C C
charge: -0.045924 -0.311600 -0.259425 0.251240 -0.000280 -0.021998 0.025772 0.016018 0.008713 0.209586 0.222647 -0.055925 -0.054661 0.052608 0.057566 -0.094337
polarizability: 2.24713838e+02 1.00638717e+01 1.48136303e+02 -7.23886105e+00 4.91515500e+00 9.46755827e+01
1716.lowfreq: -9.1554 -3.7910 -0.0011 -0.0009 0.0006 10.9901 31.4858 35.4084 56.7710
frequency: 31.3108 35.3918 56.7270 75.9650 95.9385 131.2664 190.7367 214.4207 231.2316 268.8927 294.6269 301.1318 358.4487 380.5332 410.1435 450.9299 457.9712 469.4060 482.0772 505.2741 621.6326 638.1138 670.8976 693.0227 740.7002 771.9217 787.3989 798.0958 823.6530 838.5749 851.1038 865.2019 873.6665 893.8588 924.8836 976.4781 987.5493 998.9046 1011.3662 1049.3554 1053.2643 1060.8735 1069.4853 1090.1150 1107.3755 1118.3303 1121.2384 1164.9488 1176.4741 1234.8553 1242.9329 1259.9439 1270.3602 1289.5396 1316.9182 1324.1700 1333.0627 1339.3695 1351.3315 1360.2932 1362.5114 1376.4481 1394.9707 1451.3813 1459.9449 1462.4929 1469.4343 1471.0387 1476.0499 1575.5711 1597.3660 1613.5905 2963.3175 2978.4566 2981.5682 2983.3890 2985.8846 3030.1412 3034.1001 3039.4080 3046.1347 3051.9310 3057.3773 3157.2331 3164.0713 3177.5410 3184.4278
redmass: 3.6599 4.6359 4.4782 5.9196 8.2061 4.2850 2.7725 4.3512 5.2731 6.1097 2.8681 5.9830 2.1478 2.6791 2.9082 4.1241 3.4621 2.2987 2.7063 6.8342 6.9120 2.8981 4.6787 7.4396 3.8179 1.5335 4.0393 3.0154 3.8708 1.2619 1.5936 2.2887 1.7419 2.8322 1.4032 1.3547 1.3622 4.6801 2.7893 1.4433 1.7451 4.1494 2.7711 1.6169 1.3697 1.0371 2.0627 1.7134 1.1285 1.3447 2.9527 1.2443 1.2510 1.2484 1.6930 1.5112 1.3974 1.4568 1.4438 1.3995 1.4967 5.6581 4.0651 1.0834 1.0888 1.0867 1.0813 2.4427 1.0928 8.6245 6.2920 10.7628 1.0634 1.0639 1.0630 1.0626 1.0622 1.0932 1.0901 1.0993 1.0990 1.1005 1.1008 1.0890 1.0890 1.0968 1.0973
irintensity: 0.1896 0.1004 0.1081 0.5388 2.0808 0.0966 1.4619 2.5836 8.8313 1.5830 0.2761 1.9847 0.9834 6.2864 0.0012 0.6344 10.2825 10.3628 3.6966 18.7991 1.6126 0.9692 19.7076 11.6538 24.7421 0.6826 0.5290 12.3714 4.4917 2.2704 46.5591 9.4789 23.7499 34.4409 10.1782 0.8092 0.3836 111.4005 21.6189 1.9522 57.8122 232.4069 51.3907 2.9970 8.8041 0.8132 9.4576 11.5390 43.7255 46.8469 356.5829 5.4872 4.0515 0.5523 2.1638 9.3887 0.8818 0.7329 1.9668 3.5599 1.8091 5.4901 15.7958 11.4113 10.8521 10.3172 18.1327 41.4258 6.9665 18.3870 88.9615 178.2723 40.9464 6.8143 47.2026 17.2414 30.8213 77.8322 5.4017 62.5365 26.6009 28.5160 95.3547 0.0113 0.7273 3.6396 1.7894
temp: 298.150 k
press: 1.00000 atm
elementType: 17 8 8 6 6 6 6 6 6 6 6 6 6 6 6 6 1 1 1 1 1 1 1 1 1 1 1 1 1 1 1
symmnumber: 1
zpe: 658481.2 jmol-1
zpe.correction: 0.250802 hartree
zpe.thermalcorrener: 0.265436 hartree
zpe.thermalcorrenthalpy: 0.266380 hartree
zpe.thermalcorrgfe: 0.207316 hartree
zpe.sumelectzpe: -1113.721757 hartree
zpe.sumelectthermal: -1113.707123 hartree
zpe.sumelectthermalent: -1113.706178 hartree
zpe.sumelectthermalfe: -1113.765243 hartree
dipole: 2.1664 -1.4560 -0.1816
dipole: 2.6165
quadrupole: -97.8470 -103.3423 -102.4222
quadrupole: -4.6911 -1.2193 1.1236
quadrupole: 3.3569 -2.1385 -1.2184 -4.6911 -1.2193 1.1236
hfenergy: -1113.9725588 hartree
pointgroup: C01 [X(C13H15Cl1O2)]
dipole: -0.8620571 -0.5454055 0.1382228 debye
polarizability: 224.8364385|-9.8307031|143.0289724|4.4976908|-17.1053945|99.6603125 unknown
InChI: InChI=1S/C13H15ClO2/c14-11-8-6-10(7-9-11)13(15)16-12-4-2-1-3-5-12/h6-9,12H,1-5H2
charge 0 multiplicity 1
31 atoms
Cl 5.667762 -1.055627 0.435989
O  -1.002087 0.237929 0.254833
O  -0.257578 2.311135 -0.524272
C  -2.432918 0.711817 0.152308
C  -2.930631 0.520258 -1.294416
C  -3.223271 -0.125339 1.169677
C  -3.028189 -0.971873 -1.690089
C  -3.321638 -1.614913 0.761165
C  -3.880799 -1.769664 -0.673812
C  -0.012973 1.145519 -0.119124
C  1.357838 0.571369 0.029315
C  2.464588 1.390485 -0.312888
C  1.577831 -0.750244 0.496415
C  3.780789 0.901865 -0.192103
C  2.890154 -1.251684 0.621675
C  3.970594 -0.414989 0.274794
H  -2.431612 1.785439 0.416638
H  -2.2740 1.078227 -1.986122
H  -3.934868 0.987763 -1.359943
H  -4.242153 0.308767 1.232989
H  -2.762216 -0.020347 2.169209
H  -2.009944 -1.406527 -1.73203
H  -3.457569 -1.058698 -2.706422
H  -3.959402 -2.157361 1.484993
H  -2.313782 -2.071675 0.8112
H  -4.927546 -1.400427 -0.702553
H  -3.910985 -2.839227 -0.957493
H  2.275239 2.407352 -0.671171
H  0.720718 -1.375189 0.760241
H  4.639325 1.526601 -0.453079
H  3.071221 -2.26854 0.980972
