program: Gaussian 09
title: 000222384
version: EM64L-G09RevD.01
frameworkgroup: C1[X(C12H24ClNO)]
method: RPBEPBE
basis: SDD
operation: Freq
keyword: #p
keyword: freq=noraman
keyword: PBEPBE/SDD
title: #p freq=noraman PBEPBE/SDD
converged: YES YES NO NO
title: Mulliken charges:
elementType: Cl O N C C C C C C C C C C C C H H H H H H H H H H H H H H H H H H H H H H H H
charge: -0.019276 -0.251304 -0.108723 -0.422627 -0.394754 -0.352993 -0.356915 -0.329465 -0.334887 -0.358455 -0.361131 0.280178 -0.692659 -0.694575 -0.717991 0.225178 0.222940 0.201819 0.256634 0.201497 0.202726 0.234874 0.181796 0.188161 0.188648 0.181439 0.198095 0.201215 0.199495 0.204066 0.194080 0.210488 0.211599 0.220438 0.208123 0.213684 0.217014 0.274764 0.276805
chargesum: 0.00000
title: Mulliken charges with hydrogens summed into heavy atoms:
elementType: Cl O N C C C C C C C C C C C C
charge: -0.019276 -0.251304 -0.108723 0.025491 0.063700 0.051229 0.059755 0.047344 0.044647 0.042255 0.037015 0.280178 -0.050134 -0.055754 -0.166422
polarizability: 1.67797120e+02 7.35745512e-02 1.68085491e+02 -4.73083307e+00 -4.64258758e+00 1.16394933e+02
1716.lowfreq: -11.9983 -5.5816 -1.8206 -0.0020 -0.0014 0.0017 14.3845 24.6273 31.9534
frequency: 13.3761 24.5815 31.8794 47.1218 50.6358 61.6904 79.6341 84.4736 96.0493 125.5177 132.7140 135.3317 165.9111 189.1882 196.3733 227.5258 242.7607 278.5113 304.0482 330.0335 350.7018 376.2409 427.8919 457.5825 520.0942 561.1656 624.9103 725.9027 728.9365 742.4753 752.8960 757.2662 779.1182 835.7528 839.1367 891.3521 894.5504 921.2926 948.0146 959.7261 988.4857 1004.6598 1011.8559 1044.0190 1051.5255 1076.3731 1077.5443 1100.0459 1115.4748 1117.9501 1141.2351 1156.7866 1194.1508 1198.2773 1232.0104 1244.2667 1247.4037 1249.4426 1271.0443 1279.8215 1286.0412 1289.9063 1293.1961 1305.2019 1312.6185 1316.7774 1350.5431 1352.6095 1355.5371 1364.5122 1390.8001 1390.9544 1405.1990 1425.4101 1448.3958 1464.6688 1465.4035 1467.2075 1470.0166 1476.6149 1477.2965 1479.3789 1479.4188 1485.6734 1488.1330 1491.3343 1606.9031 2953.7794 2953.8634 2967.3411 2970.3901 2972.3687 2973.3443 2974.4136 2975.5242 2990.6452 2993.8494 2994.7681 2998.5645 3019.0242 3023.8033 3032.6613 3036.0946 3043.8773 3055.5800 3069.3887 3071.0844 3072.8896 3074.4918 3075.8049 3114.2906
redmass: 3.8304 5.7751 3.8361 1.7965 1.9383 3.7206 2.6351 2.6175 2.8790 3.0162 1.8620 1.8944 3.4352 4.5870 4.5017 1.1196 1.0908 4.1246 4.2911 3.0657 3.1316 2.9376 2.9990 3.2647 3.4388 3.7068 4.1374 1.0842 1.0680 2.0595 1.1681 1.7436 4.9925 1.2427 1.2536 1.9189 1.8870 1.8991 1.6448 1.2162 1.7982 3.5965 3.5719 3.1736 2.9925 2.4154 2.4443 1.6537 2.3362 2.4381 1.7404 1.1587 2.0150 1.6056 1.9565 1.2837 1.2763 1.3469 1.3040 1.2558 1.0756 1.0514 1.1535 1.2733 1.3085 1.3318 1.4490 1.5767 1.4833 1.3510 1.2121 1.2163 2.3717 1.0916 1.1028 1.0720 1.0702 1.0834 1.0756 1.0764 1.0430 1.0721 1.0424 1.0821 1.0877 1.1012 7.7769 1.0586 1.0592 1.0605 1.0591 1.0563 1.0430 1.0382 1.0576 1.0621 1.0966 1.0688 1.0895 1.1004 1.1002 1.0896 1.0703 1.0993 1.1035 1.1007 1.1008 1.0997 1.1032 1.0992 1.1075
irintensity: 0.4282 0.8951 0.7560 0.0500 0.5971 0.9188 4.3124 0.3676 1.2057 1.6384 0.0581 0.8962 0.4588 0.4248 0.2602 0.0036 0.0049 1.3411 1.5656 0.1039 3.7389 10.0342 2.6072 5.2386 2.5078 7.7708 6.0201 14.1862 13.4808 22.6860 2.2744 17.7414 0.9148 4.7545 6.4241 4.8214 3.1472 6.1311 0.2288 0.3377 0.2284 8.8576 4.2088 3.4039 3.3087 0.6077 0.9153 20.8105 6.5002 13.3728 70.6987 7.7965 8.6492 23.1537 19.2018 0.8657 2.7633 31.0722 5.6746 5.2514 1.4835 1.2866 12.2331 13.8240 0.8856 3.0733 7.1305 1.0529 4.8594 3.8201 11.5118 13.0061 76.5638 15.2794 13.0662 0.6096 0.5803 2.5080 2.3138 2.7731 11.9798 6.0018 12.0383 4.4591 20.9021 23.3158 230.2260 18.3653 7.1727 11.8797 14.8520 81.5235 22.0962 52.0303 24.1326 67.2455 4.1328 18.5660 15.6363 1.3305 13.7126 8.5633 27.6866 28.9607 65.8075 54.2792 89.1861 46.0378 66.4952 48.5618 7.6246
temp: 298.150 k
press: 1.00000 atm
elementType: 17 8 7 6 6 6 6 6 6 6 6 6 6 6 6 1 1 1 1 1 1 1 1 1 1 1 1 1 1 1 1 1 1 1 1 1 1 1 1
symmnumber: 1
zpe: 898768.3 jmol-1
zpe.correction: 0.342323 hartree
zpe.thermalcorrener: 0.362035 hartree
zpe.thermalcorrenthalpy: 0.362979 hartree
zpe.thermalcorrgfe: 0.289554 hartree
zpe.sumelectzpe: -1060.474597 hartree
zpe.sumelectthermal: -1060.454885 hartree
zpe.sumelectthermalent: -1060.453941 hartree
zpe.sumelectthermalfe: -1060.527366 hartree
dipole: -1.7946 -5.7064 1.8932
dipole: 6.2744
quadrupole: -97.9318 -119.4546 -101.2767
quadrupole: -1.3465 0.1547 4.9843
quadrupole: 8.2892 -13.2336 4.9443 -1.3465 0.1547 4.9843
hfenergy: -1060.8169198 hartree
pointgroup: C01 [X(C12H24Cl1N1O1)]
dipole: -0.866753 2.1915925 -0.7344302 debye
polarizability: 167.7971053|-0.1153196|168.1166487|5.1175255|-4.0158028|116.3637898 unknown
InChI: InChI=1S/C12H24ClNO/c1-3-5-7-9-14(12(15)11-13)10-8-6-4-2/h3-11H2,1-2H3
charge 0 multiplicity 1
39 atoms
Cl -1.154991 -4.529136 -0.082486
O  1.012992 -2.599015 0.707999
N  0.026804 -0.605421 0.02662
C  -1.049931 0.164775 -0.636427
C  1.139301 0.161877 0.640649
C  -2.164495 0.63567 0.329808
C  2.328455 0.376937 -0.32305
C  -3.24755 1.474542 -0.385179
C  3.47223 1.17592 0.340405
C  -4.355181 1.970115 0.572853
C  4.679921 1.39661 -0.599141
C  0.067712 -1.992155 0.125897
C  -5.441506 2.799235 -0.145244
C  5.829292 2.176662 0.074976
C  -1.110573 -2.728679 -0.548367
H  -0.586154 1.048555 -1.116596
H  -1.492967 -0.429457 -1.456846
H  0.738189 1.137132 0.978876
H  1.486854 -0.396604 1.527456
H  -2.631933 -0.245966 0.812999
H  -1.709512 1.232117 1.145625
H  2.701838 -0.614232 -0.642969
H  1.983277 0.907414 -1.234658
H  -2.77457 2.34994 -0.878119
H  -3.709373 0.872917 -1.196306
H  3.091923 2.161836 0.683045
H  3.812407 0.638586 1.249741
H  -4.823077 1.0976 1.072119
H  -3.894435 2.578253 1.377622
H  5.052835 0.411836 -0.9462
H  4.343435 1.939542 -1.506079
H  -5.003393 3.689969 -0.634035
H  -5.945355 2.20118 -0.927793
H  -6.215366 3.149148 0.561983
H  5.489559 3.175323 0.409197
H  6.205723 1.635879 0.963581
H  6.679313 2.322701 -0.616536
H  -2.085268 -2.31346 -0.251345
H  -1.013128 -2.702146 -1.646275
