program: Gaussian 09
title: 000222383
version: EM64L-G09RevD.01
frameworkgroup: C1[X(C12H16ClNO)]
method: RPBEPBE
basis: SDD
operation: Freq
keyword: #p
keyword: freq=noraman
keyword: PBEPBE/SDD
title: #p freq=noraman PBEPBE/SDD
converged: YES YES NO NO
title: Mulliken charges:
elementType: Cl O N C C C C C C C C C C C C H H H H H H H H H H H H H H H H
charge: -0.016112 -0.218912 -0.259884 -0.419869 -0.328849 -0.333955 0.488791 -0.691792 0.247687 -0.328475 -0.389457 -0.720052 -0.219353 -0.215575 -0.244454 0.228113 0.223555 0.217380 0.192325 0.193595 0.197248 0.216195 0.220511 0.213774 0.265315 0.234008 0.276635 0.282994 0.229742 0.227608 0.231262
chargesum: 0.00000
title: Mulliken charges with hydrogens summed into heavy atoms:
elementType: Cl O N C C C C C C C C C C C C
charge: -0.016112 -0.218912 -0.259884 0.031799 0.080855 0.056889 0.488791 -0.041311 0.247687 -0.063160 -0.155449 -0.160424 0.010389 0.012033 -0.013192
polarizability: 1.85574226e+02 4.09162081e+00 1.33008786e+02 -4.65952415e-01 -1.79045047e+01 1.20329049e+02
1716.lowfreq: -6.1857 -0.0010 0.0008 0.0013 4.3823 15.5230 31.0755 35.4942 49.2249
frequency: 30.9814 35.3289 49.1886 63.5325 72.8731 97.2273 105.0513 139.7381 185.5818 214.5271 234.1085 240.8566 269.2137 319.3312 364.9092 376.6432 406.8501 442.4460 502.1197 557.9763 563.0439 614.3737 633.3990 696.8964 726.4127 732.9780 754.0134 771.7257 786.8181 838.4069 867.2897 901.7593 913.8735 923.0101 940.0368 968.3615 988.2883 992.4447 1010.4207 1025.8138 1071.0304 1078.0045 1098.9889 1112.0371 1124.4339 1159.8031 1173.1158 1186.9025 1203.1235 1217.2291 1262.5417 1265.1655 1280.2154 1286.3192 1317.1509 1342.2125 1357.9186 1364.2558 1382.0342 1397.1023 1423.9710 1439.9550 1469.4907 1473.6481 1478.8686 1482.1548 1486.0625 1495.2939 1591.9944 1603.0410 1618.6846 2964.3758 2976.1165 2977.8375 3007.5348 3018.3241 3036.6684 3039.0651 3071.2620 3076.2062 3077.5627 3118.7022 3127.1565 3136.5903 3148.6316 3164.0586 3181.6838
redmass: 5.6234 5.2019 3.9034 6.0032 1.5957 2.8355 4.1729 2.5150 4.0848 4.0662 1.1526 5.5551 6.6005 3.8729 3.4166 3.4655 2.8619 3.6851 3.5272 3.6931 4.8158 6.3743 4.4904 1.8469 6.2441 1.1237 3.1007 2.1136 1.3478 1.2587 2.7725 1.7242 1.4225 1.8113 1.4029 1.3775 2.8090 1.7669 4.1192 2.2861 2.4857 1.9359 2.5560 2.2843 1.7909 1.0967 1.0500 1.1558 1.8540 2.2821 1.5290 1.2823 1.3265 1.0751 1.3332 1.4076 1.6413 1.8787 8.4700 1.2121 1.0865 2.2936 1.0744 1.0774 1.0438 1.9489 1.1358 1.1094 6.4464 7.0228 8.2950 1.0593 1.0517 1.0460 1.0985 1.0602 1.0938 1.0645 1.1020 1.1023 1.0998 1.1073 1.0850 1.0885 1.0941 1.0987 1.0972
irintensity: 0.1190 0.3794 0.3463 1.8546 0.6058 5.6208 1.1899 2.3626 0.3935 0.4945 0.0231 0.4967 2.5413 1.7260 1.0606 3.3009 0.5631 4.3670 6.9538 3.4585 9.6540 0.6143 17.5198 46.6372 14.3617 18.2088 47.4481 26.6933 0.7302 1.9842 8.9261 5.2844 1.7156 8.1770 3.7720 0.2488 0.4206 0.1651 2.7714 7.4661 0.9124 22.3925 29.1298 17.0876 51.9616 0.6206 0.0773 3.0262 63.2544 28.0917 33.7374 6.3040 22.3805 1.2341 3.9953 1.9482 52.2820 84.3403 1.5330 10.1159 13.1048 5.2065 1.3630 4.5616 17.5486 59.3320 6.7455 22.0740 19.0367 71.9664 141.9000 22.5059 19.7372 41.3171 5.5691 33.1996 11.8022 21.8599 2.9827 97.1436 55.4325 6.3657 3.5496 4.8496 30.9036 25.6099 2.3634
temp: 298.150 k
press: 1.00000 atm
elementType: 17 8 7 6 6 6 6 6 6 6 6 6 6 6 6 1 1 1 1 1 1 1 1 1 1 1 1 1 1 1 1
symmnumber: 1
zpe: 668248.2 jmol-1
zpe.correction: 0.254522 hartree
zpe.thermalcorrener: 0.270243 hartree
zpe.thermalcorrenthalpy: 0.271187 hartree
zpe.thermalcorrgfe: 0.209063 hartree
zpe.sumelectzpe: -1055.774624 hartree
zpe.sumelectthermal: -1055.758904 hartree
zpe.sumelectthermalent: -1055.757960 hartree
zpe.sumelectthermalfe: -1055.820084 hartree
dipole: 1.5226 5.6390 -1.6176
dipole: 6.0608
quadrupole: -93.5137 -109.0376 -90.7235
quadrupole: -8.1826 2.8343 -1.4461
quadrupole: 4.2446 -11.2793 7.0348 -8.1826 2.8343 -1.4461
hfenergy: -1056.0291463 hartree
pointgroup: C01 [X(C12H16Cl1N1O1)]
dipole: 0.4031635 -2.2774489 -0.5801143 debye
polarizability: 174.3844718|21.164499|145.361499|-3.6066586|17.6198118|119.1660898 unknown
InChI: InChI=1S/C12H16ClNO/c1-2-3-9-14(12(15)10-13)11-7-5-4-6-8-11/h4-8H,2-3,9-10H2,1H3
charge 0 multiplicity 1
31 atoms
Cl 2.673449 3.652907 0.353961
O  -0.129245 2.608995 0.264712
N  0.277889 0.404549 -0.418499
C  1.241162 -0.667376 -0.799217
C  1.758092 -1.475683 0.413788
C  2.703039 -2.624747 -0.007182
C  -1.109052 0.012967 -0.237167
C  3.217497 -3.438096 1.199929
C  0.674545 1.718444 -0.118717
C  -1.785673 0.29358 0.975379
C  -1.78597 -0.671489 -1.276487
C  2.177419 2.001537 -0.344445
C  -3.125011 -0.117482 1.143908
C  -3.123058 -1.089414 -1.097281
C  -3.798179 -0.81512 0.113933
H  0.731659 -1.354644 -1.497526
H  2.086828 -0.23209 -1.360818
H  0.889559 -1.888465 0.962959
H  2.284811 -0.801144 1.119191
H  3.565701 -2.209917 -0.568276
H  2.169769 -3.299296 -0.707739
H  2.377641 -3.890977 1.759091
H  3.889392 -4.254406 0.878487
H  3.779543 -2.794535 1.902435
H  -1.271569 0.844509 1.766866
H  -1.281339 -0.855744 -2.231655
H  2.822431 1.258976 0.148008
H  2.410998 2.044973 -1.42084
H  -3.642702 0.107551 2.082785
H  -3.638879 -1.614972 -1.908503
H  -4.837247 -1.133693 0.25072
