program: Gaussian 09
title: 000222381
version: EM64L-G09RevD.01
frameworkgroup: C1[X(C12H13ClO3)]
method: RPBEPBE
basis: SDD
operation: Freq
keyword: #p
keyword: freq=noraman
keyword: PBEPBE/SDD
title: #p freq=noraman PBEPBE/SDD
converged: YES YES NO NO
title: Mulliken charges:
elementType: Cl O O O C C C C C C C C C C C C H H H H H H H H H H H H H
charge: -0.002312 -0.275214 -0.295100 -0.232867 -0.020694 -0.465753 -0.476033 -0.292786 -0.326568 0.204516 0.308874 -0.276518 -0.319162 -0.214332 -0.226569 -0.210948 0.234562 0.220752 0.259953 0.238085 0.234198 0.221741 0.201033 0.245695 0.240265 0.284788 0.261469 0.238775 0.240149
chargesum: 0.00000
title: Mulliken charges with hydrogens summed into heavy atoms:
elementType: Cl O O O C C C C C C C C C C C C
charge: -0.002312 -0.275214 -0.295100 -0.232867 0.213867 0.014953 -0.003750 0.129988 0.159392 0.204516 0.308874 -0.276518 -0.034375 0.047137 0.012206 0.029201
polarizability: 1.96881051e+02 9.13730662e+00 1.57672187e+02 -1.51184357e+01 -4.02314898e+00 8.56338323e+01
1716.lowfreq: -28.2647 -9.7116 -0.0014 0.0016 0.0021 2.6471 3.6811 12.0283 32.7490
frequency: -22.7317 9.0603 32.6822 62.0714 81.6373 113.8821 148.6728 197.4250 206.8816 216.8264 248.8252 306.5885 347.5087 354.6586 396.6764 434.7586 456.7490 491.0280 518.8239 587.3332 636.6568 668.6628 678.4605 699.0196 744.0314 767.6553 780.6255 816.9904 830.6339 859.0046 881.7736 889.3436 910.0172 917.7805 971.1304 989.5315 992.2713 1001.0963 1010.3866 1026.7848 1037.5125 1061.8032 1085.7461 1129.5666 1133.1215 1151.2068 1169.8006 1175.6271 1218.9451 1219.3988 1232.2901 1261.3367 1265.9978 1300.3805 1311.5449 1329.0573 1341.9732 1369.1178 1375.3120 1417.5859 1450.2984 1458.1445 1459.7759 1473.8608 1490.4999 1568.5147 1600.1298 1628.6442 2979.5899 3013.3089 3019.2191 3030.9349 3041.0496 3064.3885 3087.3387 3100.8617 3120.5117 3141.9267 3159.7280 3175.1711 3189.9941
redmass: 4.0822 5.2580 4.9087 7.4711 4.1449 4.4502 4.0532 7.0230 3.1528 4.6318 3.3033 4.6659 10.1401 5.3397 2.3909 3.5514 5.8716 4.0655 5.8686 1.9695 6.4209 4.8417 5.2844 6.4512 2.5776 5.6332 1.6477 2.4205 2.5973 2.4052 1.3848 1.7136 5.9844 2.9003 1.3710 1.7542 2.5869 1.3503 4.7128 3.2233 3.3421 3.0529 1.4835 1.4560 1.6079 1.5419 1.7887 1.0596 2.3249 1.5042 1.2954 1.2905 1.3650 1.3976 1.2573 1.2919 1.3320 1.4425 8.0081 2.1145 1.1135 2.3409 1.0934 1.0926 1.0935 6.4077 6.7707 10.4806 1.0646 1.0696 1.0616 1.0801 1.0596 1.0998 1.1021 1.1037 1.1087 1.0867 1.0921 1.0971 1.0961
irintensity: 0.8062 0.9629 2.6938 2.3114 1.3079 0.0941 1.9434 0.8108 1.0586 2.5462 7.1824 6.1218 9.3899 6.5745 3.8932 1.4886 12.5602 8.8786 5.3759 5.1643 8.8983 17.4313 12.5213 2.1071 42.6877 15.8245 41.8110 13.3917 6.2143 4.2728 0.0423 3.5211 32.6635 6.0353 2.3598 17.6514 63.8493 0.6013 211.7378 80.8270 44.9433 108.3789 0.1432 2.1855 21.7144 1.5562 2.2159 5.5841 178.6591 105.4537 0.6865 5.9246 6.7222 10.9325 2.8026 4.0080 1.3330 10.0473 12.6478 20.1067 22.7623 35.1290 9.7715 18.6253 1.6123 14.6437 27.1773 173.5753 96.2112 14.4065 18.9775 27.8253 37.6892 33.7265 25.7819 35.6722 8.2705 2.9956 11.4024 8.5285 6.3580
temp: 298.150 k
press: 1.00000 atm
elementType: 17 8 8 8 6 6 6 6 6 6 6 6 6 6 6 6 1 1 1 1 1 1 1 1 1 1 1 1 1
symmnumber: 1
zpe: 592900.1 jmol-1
zpe.correction: 0.225824 hartree
zpe.thermalcorrener: 0.239892 hartree
zpe.thermalcorrenthalpy: 0.240836 hartree
zpe.thermalcorrgfe: 0.181778 hartree
zpe.sumelectzpe: -1149.606966 hartree
zpe.sumelectthermal: -1149.592898 hartree
zpe.sumelectthermalent: -1149.591954 hartree
zpe.sumelectthermalfe: -1149.651012 hartree
dipole: -1.2270 -1.6687 1.6544
dipole: 2.6509
quadrupole: -85.6582 -100.9536 -100.5524
quadrupole: 13.6568 0.9326 -0.1035
quadrupole: 10.0632 -5.2321 -4.8310 13.6568 0.9326 -0.1035
hfenergy: -1149.8327899 hartree
pointgroup: C01 [X(C12H13Cl1O3)]
dipole: 0.5364113 -0.8365006 0.3166093 debye
polarizability: 197.4306336|-19.1372187|97.1686026|-2.7915827|-24.9784352|145.5878345 unknown
InChI: InChI=1S/C12H13ClO3/c13-11-6-2-1-5-10(11)12(14)16-8-9-4-3-7-15-9/h1-2,5-6,9H,3-4,7-8H2
charge 0 multiplicity 1
29 atoms
Cl 2.239607 0.856181 -2.684742
O  -4.206954 -0.27661 1.259607
O  -0.490067 0.066151 0.999826
O  -0.309393 0.90767 -1.168621
C  -2.848543 -0.722415 0.838482
C  -2.989346 -1.187806 -0.629079
C  -4.152092 -0.310767 -1.162532
C  -5.089257 -0.229204 0.059261
C  -1.918897 0.489548 1.051211
C  0.220825 0.347775 -0.181456
C  1.642065 -0.108701 -0.06307
C  2.609017 0.058708 -1.093654
C  2.068965 -0.748956 1.138066
C  3.937463 -0.390337 -0.934292
C  3.39018 -1.200302 1.306116
C  4.329963 -1.020809 0.264728
H  -2.539153 -1.540101 1.514915
H  -3.271614 -2.255939 -0.656305
H  -2.061439 -1.051986 -1.206885
H  -3.778946 0.689787 -1.444887
H  -4.646919 -0.753967 -2.042999
H  -5.672191 0.706102 0.11419
H  -5.781047 -1.094356 0.097528
H  -2.062096 0.888527 2.067495
H  -2.095506 1.275811 0.29768
H  1.330373 -0.877017 1.932394
H  4.65313 -0.242555 -1.748002
H  3.686107 -1.687447 2.240486
H  5.362866 -1.365985 0.37964
