program: Gaussian 09
title: 000222398
version: EM64L-G09RevD.01
frameworkgroup: C1[X(C14H9Cl3O2)]
method: RPBEPBE
basis: SDD
operation: Freq
keyword: #p
keyword: freq=noraman
keyword: PBEPBE/SDD
title: #p freq=noraman PBEPBE/SDD
converged: YES YES NO NO
title: Mulliken charges:
elementType: Cl Cl Cl O O C C C C C C C C C C C C C C H H H H H H H H H
charge: -0.014521 -0.036068 -0.003253 -0.280666 -0.162612 0.270226 0.336145 0.326629 -0.352300 -0.246902 -0.385325 -0.397998 -0.114461 -0.252101 -0.240752 -0.226835 -0.234310 0.322003 -0.699008 0.284476 0.266470 0.247762 0.286791 0.236991 0.231717 0.234855 0.301226 0.301822
chargesum: 0.00000
title: Mulliken charges with hydrogens summed into heavy atoms:
elementType: Cl Cl Cl O O C C C C C C C C C C C C C C
charge: -0.014521 -0.036068 -0.003253 -0.280666 -0.162612 0.270226 0.336145 0.326629 -0.067824 -0.246902 -0.118854 -0.150236 -0.114461 0.034690 -0.003761 0.004882 0.000545 0.322003 -0.095960
polarizability: 2.34136031e+02 1.37345588e+01 2.21203059e+02 9.12202390e+00 -4.28152560e+00 1.04396056e+02
1716.lowfreq: -5.6761 -4.9687 -0.0018 -0.0018 -0.0015 2.1465 20.2325 32.8211 45.1297
frequency: 20.2031 32.7920 45.1195 58.0000 66.3026 73.8472 81.3099 127.8820 164.4012 168.6754 198.9041 224.0351 236.1025 263.2368 277.8481 307.7044 357.3618 393.0962 407.6452 421.0867 461.5295 518.1530 540.0886 572.1851 578.2216 615.1467 620.1856 648.3269 668.0698 708.4626 730.5272 761.5235 771.1403 792.5610 810.3938 858.8113 858.9893 882.2013 887.4427 912.9674 932.0637 981.4411 989.8701 1001.5701 1015.2288 1041.1503 1060.4357 1084.2692 1095.3247 1156.1306 1168.6834 1175.4508 1195.4790 1196.9413 1278.6434 1285.9679 1316.0377 1357.3013 1371.6651 1389.3877 1420.4959 1424.5167 1440.1260 1490.0340 1554.1225 1585.9273 1590.0799 1612.0431 1703.5755 3059.0494 3126.6819 3133.6527 3138.5830 3145.4262 3155.5612 3168.5504 3173.6303 3189.2686
redmass: 12.2707 16.0792 3.6791 3.5356 7.9017 8.7548 7.1132 8.8183 8.4523 11.8706 7.3845 10.0837 7.6158 8.6704 5.8727 9.2898 8.7585 8.0644 2.8905 9.6093 4.2217 3.4044 5.5692 4.5900 4.9731 6.3525 7.3208 6.1975 7.3423 1.8067 5.3075 8.6283 2.0491 6.5814 7.9650 1.3908 1.2633 1.7217 3.7630 1.7829 1.4012 1.5397 3.9942 1.3273 4.7531 2.4453 3.9161 1.7111 2.0556 1.1793 2.5847 1.0575 1.1626 1.8334 2.3517 1.3761 1.4562 6.6363 5.0096 4.3988 1.1037 2.8549 2.5296 2.6158 7.6276 6.1535 8.6887 6.0304 11.4441 1.0577 1.0855 1.0878 1.1064 1.0924 1.0962 1.1016 1.0927 1.0938
irintensity: 0.9281 0.4272 1.2334 6.3867 0.4320 0.0506 0.9034 0.5817 0.2348 0.5117 1.4838 3.1440 0.7552 1.3090 0.7736 1.0992 1.3562 4.7588 0.3746 10.4172 1.8564 4.6065 4.3344 7.4215 17.7866 1.4595 9.2058 3.0927 13.5138 52.6341 13.3849 104.1863 43.8106 20.4379 32.3011 23.2989 3.3759 9.2293 56.8523 7.6961 0.8211 1.4144 0.8444 0.2217 36.5432 86.5538 350.6250 17.8047 5.3851 25.4408 31.5940 0.3726 4.5046 28.9509 3.8342 21.9229 5.2661 5.5958 9.3888 40.2659 50.5983 62.5297 29.1908 11.2653 65.1351 3.9805 53.3561 0.2176 120.8159 7.7927 2.5144 1.6890 0.3467 15.2566 20.5698 20.9685 0.2194 2.7408
temp: 298.150 k
press: 1.00000 atm
elementType: 17 17 17 8 8 6 6 6 6 6 6 6 6 6 6 6 6 6 6 1 1 1 1 1 1 1 1 1
symmnumber: 1
zpe: 498405.2 jmol-1
zpe.correction: 0.189833 hartree
zpe.thermalcorrener: 0.207459 hartree
zpe.thermalcorrenthalpy: 0.208404 hartree
zpe.thermalcorrgfe: 0.140803 hartree
zpe.sumelectzpe: -2068.177701 hartree
zpe.sumelectthermal: -2068.160074 hartree
zpe.sumelectthermalent: -2068.159130 hartree
zpe.sumelectthermalfe: -2068.226731 hartree
dipole: -0.5861 2.3632 -2.4943
dipole: 3.4856
quadrupole: -135.3481 -117.1384 -133.8422
quadrupole: 3.5622 -3.4350 1.9493
quadrupole: -6.5718 11.6378 -5.0660 3.5622 -3.4350 1.9493
hfenergy: -2068.3675333 hartree
pointgroup: C01 [X(C14H9Cl3O2)]
dipole: -0.4535973 -0.7884527 -1.0262431 debye
polarizability: 241.7582296|-2.4174768|210.8627917|-10.6209704|17.4424779|107.114125 unknown
InChI: InChI=1S/C14H9Cl3O2/c15-8-13(18)19-14-11(6-10(16)7-12(14)17)9-4-2-1-3-5-9/h1-7H,8H2
charge 0 multiplicity 1
28 atoms
Cl 2.43739 2.818308 -0.486566
Cl 4.37734 -2.330622 0.228923
Cl -2.76408 4.218938 0.885837
O  -0.251807 1.444491 -0.590346
O  -0.444239 2.262474 1.60739
C  0.556276 -0.83544 -0.122252
C  -0.826173 -1.400272 -0.123066
C  0.814017 0.553904 -0.272401
C  1.669407 -1.707013 0.017728
C  2.138389 1.043797 -0.260351
C  -1.83869 -0.873453 0.722743
C  -1.131524 -2.51651 -0.946696
C  2.975551 -1.190103 0.028148
C  3.24157 0.186387 -0.102208
C  -3.128855 -1.445378 0.734138
C  -2.42444 -3.083502 -0.938016
C  -3.428794 -2.548435 -0.098781
C  -0.749645 2.324677 0.41168
C  -1.675032 3.296529 -0.299973
H  1.497842 -2.778518 0.150054
H  -1.606173 -0.047317 1.402895
H  -0.361826 -2.922591 -1.613282
H  4.261204 0.577375 -0.088963
H  -3.895672 -1.035291 1.40031
H  -2.64766 -3.93736 -1.586987
H  -4.431844 -2.988779 -0.090074
H  -2.320936 2.757549 -1.007413
H  -1.073095 4.042354 -0.842566
