program: Gaussian 09
title: 000222380
version: EM64L-G09RevD.01
frameworkgroup: C1[X(C11H19ClO2)]
method: RPBEPBE
basis: SDD
operation: Freq
keyword: #p
keyword: freq=noraman
keyword: PBEPBE/SDD
title: #p freq=noraman PBEPBE/SDD
converged: YES YES NO NO
title: Mulliken charges:
elementType: Cl O O C C C C C C C C C C C H H H H H H H H H H H H H H H H H H H
charge: -0.055192 -0.267483 -0.236813 0.039171 -0.449073 -0.448098 -0.403797 -0.401918 -0.383027 -0.442099 -0.525103 0.251155 -0.234234 -0.553224 0.186673 0.188195 0.209150 0.200727 0.190728 0.196873 0.190430 0.192256 0.197192 0.199035 0.187819 0.206767 0.232877 0.245887 0.256238 0.225874 0.268009 0.257997 0.277008
chargesum: 0.00000
title: Mulliken charges with hydrogens summed into heavy atoms:
elementType: Cl O O C C C C C C C C C C C
charge: -0.055192 -0.267483 -0.236813 0.225844 -0.051727 -0.056643 -0.016494 -0.012471 0.003828 -0.002455 -0.022978 0.251155 0.259648 -0.018219
polarizability: 1.59063469e+02 7.14465531e-02 1.15612817e+02 7.38917608e+00 2.07850544e+00 1.16564430e+02
1716.lowfreq: -20.0512 -2.0069 -0.0028 -0.0019 -0.0018 7.8991 19.1710 23.7714 26.2943
frequency: -14.9582 23.5400 26.1069 54.8177 75.2105 87.5765 135.6131 175.0312 195.7328 206.6735 226.1581 275.0445 310.4717 322.1915 399.6690 426.4757 431.0930 441.5389 474.5900 540.0623 557.7853 609.4361 675.9006 759.0827 779.1152 784.7854 800.8838 842.6234 864.3583 883.3357 894.7103 911.8635 947.0340 961.8233 978.6918 991.5768 1045.2300 1053.9037 1057.1224 1076.0705 1082.3731 1100.4662 1104.7967 1115.5237 1133.8763 1175.0620 1183.3031 1187.6870 1221.8061 1244.2865 1253.2169 1257.3818 1270.2412 1282.9933 1298.8047 1308.8024 1319.1384 1334.2568 1336.5760 1338.4965 1342.9454 1350.7755 1363.7748 1368.7442 1433.9718 1442.0122 1458.8119 1461.4394 1461.7097 1465.3650 1468.5381 1472.7005 1479.6019 1656.9334 2928.1025 2952.1108 2957.6733 2963.9949 2964.6990 2965.4354 2973.6950 2982.5565 2999.7870 3016.4214 3021.1656 3025.4265 3027.6440 3036.3994 3040.8078 3058.5708 3072.1029 3081.9776 3143.4557
redmass: 3.7556 10.4567 6.8723 4.3633 3.6777 2.3865 2.9917 2.6711 4.6758 4.4140 1.7957 3.0402 2.7475 1.9787 2.9075 2.1194 3.1608 2.8626 2.6028 1.8580 2.9556 4.8959 3.8423 1.9621 1.8144 1.5338 2.7551 1.9582 1.8877 2.4757 1.6109 1.9465 2.5799 2.2321 1.6066 1.8845 2.8808 1.5328 1.2582 1.7406 2.1872 2.3114 2.4651 2.4436 1.8722 1.5829 1.3214 1.5159 1.1392 1.3006 1.2468 1.2536 1.2198 1.2154 1.1988 1.3543 1.2474 1.4066 1.4092 1.5247 1.5920 1.3871 1.5030 1.6306 1.1024 1.0819 1.0907 1.0822 1.0876 1.0904 1.0879 1.0836 1.0950 9.5590 1.0808 1.0622 1.0620 1.0601 1.0618 1.0669 1.0650 1.0632 1.0606 1.0966 1.0994 1.0952 1.1013 1.0996 1.1019 1.0592 1.0942 1.1012 1.1097
irintensity: 0.4109 0.5258 0.8266 1.4234 3.0933 0.6742 1.6209 1.3560 0.7162 5.2957 0.1044 1.7532 12.5789 4.8998 5.3768 2.1403 0.8006 1.9409 7.5353 1.4349 4.7646 23.1757 2.9576 7.9499 2.7997 0.6839 1.2644 4.7258 1.9696 29.0097 1.4048 1.4649 37.6460 19.6756 3.9629 20.9829 20.1172 1.7602 1.7236 7.2082 72.4939 1.5160 263.9714 0.8440 33.6851 20.4817 2.4903 3.0169 1.5686 7.3572 19.4918 1.1423 22.5498 2.8043 18.7048 22.9328 7.2257 2.0706 4.7968 0.8130 1.1309 1.8552 12.5757 18.3010 10.0613 17.1937 1.7130 17.5532 3.8946 8.7248 8.6049 30.6624 3.3953 160.7186 10.2892 25.4583 49.8383 31.1697 31.8679 31.8072 11.6033 28.5791 32.8223 88.8262 42.2711 52.2523 19.0555 10.1889 146.8181 26.0262 22.7831 6.1844 10.3144
temp: 298.150 k
press: 1.00000 atm
elementType: 17 8 8 6 6 6 6 6 6 6 6 6 6 6 1 1 1 1 1 1 1 1 1 1 1 1 1 1 1 1 1 1 1
symmnumber: 1
zpe: 743427.5 jmol-1
zpe.correction: 0.283157 hartree
zpe.thermalcorrener: 0.297663 hartree
zpe.thermalcorrenthalpy: 0.298607 hartree
zpe.thermalcorrgfe: 0.239113 hartree
zpe.sumelectzpe: -1039.960079 hartree
zpe.sumelectthermal: -1039.945572 hartree
zpe.sumelectthermalent: -1039.944628 hartree
zpe.sumelectthermalfe: -1040.004122 hartree
dipole: 0.0346 -1.1144 -2.5027
dipole: 2.7398
quadrupole: -82.6983 -98.8133 -91.7529
quadrupole: -0.2515 12.3697 -0.7886
quadrupole: 8.3898 -7.7251 -0.6647 -0.2515 12.3697 -0.7886
hfenergy: -1040.2432354 hartree
pointgroup: C01 [X(C11H19Cl1O2)]
dipole: -0.0350592 -0.4551207 -0.9764859 debye
polarizability: 159.7241807|0.6711629|115.6905619|5.0471757|2.1215993|115.825973 unknown
InChI: InChI=1S/C11H19ClO2/c12-8-9-14-11(13)7-6-10-4-2-1-3-5-10/h10H,1-9H2
charge 0 multiplicity 1
33 atoms
Cl -4.909492 -0.92794 1.700504
O  -2.841932 -0.130683 -0.687689
O  -2.038738 1.839857 0.281725
C  2.030892 0.103058 0.311834
C  2.417919 -0.949117 -0.762357
C  3.188898 1.118535 0.500615
C  3.760091 -1.647517 -0.436258
C  4.530652 0.424212 0.83255
C  4.901864 -0.621839 -0.245693
C  0.711751 0.842568 -0.019032
C  -0.519895 -0.085766 -0.085904
C  -1.831343 0.67705 -0.125165
C  -4.222699 0.406267 -0.68199
C  -5.160792 -0.6633 -0.149098
H  1.892944 -0.434163 1.278025
H  2.500293 -0.437136 -1.745495
H  1.620617 -1.711289 -0.864546
H  2.924891 1.839916 1.299453
H  3.303596 1.706849 -0.434794
H  4.018729 -2.364461 -1.239932
H  3.645397 -2.239766 0.495539
H  4.446181 -0.082498 1.81664
H  5.335422 1.178838 0.929716
H  5.841786 -1.139946 0.027362
H  5.088635 -0.101624 -1.208307
H  0.822551 1.377253 -0.984386
H  0.523148 1.619885 0.746041
H  -0.552377 -0.732219 0.816169
H  -0.487007 -0.769769 -0.951214
H  -4.486596 0.632957 -1.733326
H  -4.256619 1.336076 -0.0880
H  -6.212765 -0.361588 -0.270989
H  -4.977101 -1.641097 -0.617396
