program: Gaussian 09
title: 000222377
version: EM64L-G09RevD.01
frameworkgroup: C1[X(C11H13ClO3)]
method: RPBEPBE
basis: SDD
operation: Freq
keyword: #p
keyword: freq=noraman
keyword: PBEPBE/SDD
title: #p freq=noraman PBEPBE/SDD
converged: YES YES NO NO
title: Mulliken charges:
elementType: Cl O O O C C C C C C C C C C C H H H H H H H H H H H H H
charge: -0.001865 -0.321538 -0.261978 -0.221891 0.038403 -0.317640 -0.704119 0.317337 0.212919 -0.282411 -0.324312 -0.216965 -0.230247 -0.211314 -0.495589 0.255162 0.185912 0.217593 0.260488 0.222279 0.216322 0.275739 0.261665 0.237896 0.240079 0.228213 0.193979 0.225883
chargesum: 0.00000
title: Mulliken charges with hydrogens summed into heavy atoms:
elementType: Cl O O O C C C C C C C C C C C
charge: -0.001865 -0.321538 -0.261978 -0.221891 0.293565 0.085866 -0.005029 0.317337 0.212919 -0.282411 -0.048573 0.044700 0.007649 0.028764 0.152486
polarizability: 1.69843424e+02 1.12083753e+01 1.48397950e+02 1.33318718e+01 -1.43699794e+01 9.46292107e+01
1716.lowfreq: -5.6376 -3.9468 0.0015 0.0019 0.0022 6.9712 11.8630 31.2240 57.3127
frequency: 10.6772 31.1779 57.2921 66.7494 92.5315 108.2921 134.9885 171.3069 203.1130 211.6011 217.6353 232.4661 294.4438 324.8003 344.5666 375.6411 393.9151 428.2135 439.7869 482.7571 510.0539 519.4991 639.5400 673.0135 691.6711 746.0382 777.7052 786.2237 818.0504 844.4052 881.2003 910.2968 934.5465 968.4242 998.7223 1007.0297 1035.9640 1047.8563 1063.3597 1086.9344 1105.2278 1117.3194 1132.6032 1137.1487 1166.3885 1175.3535 1218.5857 1260.4052 1267.0881 1296.6923 1337.2119 1369.6869 1374.7414 1389.6036 1417.9984 1430.1539 1440.8641 1457.1456 1458.2748 1465.7472 1475.6693 1480.0507 1569.0475 1600.1637 1628.2534 2943.1557 2946.5807 2991.8384 3038.1870 3043.3626 3060.8275 3088.7859 3102.6347 3105.6845 3141.9310 3159.1446 3175.1510 3187.4451
redmass: 5.6789 4.8200 3.8146 4.1522 4.9055 3.4348 2.9770 2.4310 2.6770 1.1084 3.0817 3.1944 4.6664 3.6482 10.8605 3.5302 3.7184 4.2086 2.8159 3.9111 4.2021 4.0208 6.5715 4.9583 6.9854 2.4702 2.1180 3.0094 4.8908 4.0209 1.3895 1.9080 1.7266 1.3737 1.3460 8.1512 3.4168 2.8073 3.2157 3.0990 2.0326 1.3596 1.6380 1.7866 1.5813 1.0584 3.1255 1.3567 1.3488 1.3516 1.2711 1.3256 8.6928 1.2112 2.1196 1.0894 1.1150 1.3899 1.5841 1.0617 1.0525 1.0455 6.4359 6.8275 11.6007 1.0553 1.0466 1.0363 1.0980 1.0855 1.0962 1.0990 1.1007 1.1001 1.0866 1.0920 1.0966 1.0967
irintensity: 0.0365 1.2595 0.9989 4.4602 0.4796 2.0724 3.3026 0.4705 0.9082 0.5397 2.0285 2.1003 5.5894 2.1730 4.6317 2.8249 6.5130 4.7596 4.6788 5.6432 16.4214 9.1150 7.8900 18.1941 9.0712 45.1044 32.1901 10.4066 26.7488 23.8218 0.6104 0.7974 7.8910 2.8427 1.0473 236.9941 28.0095 86.7122 143.0680 37.3604 5.5045 0.0706 31.0418 28.2234 5.9473 4.4408 260.0726 1.4508 22.5272 1.1188 6.1178 1.3957 6.3177 30.2113 20.8090 2.4398 8.1066 4.1652 39.1897 18.6118 13.3504 11.4654 12.7312 24.6666 182.5700 48.8309 59.0562 20.3268 57.3351 6.5017 21.5491 35.7588 42.3673 16.7266 2.6495 10.9585 8.0314 7.0311
temp: 298.150 k
press: 1.00000 atm
elementType: 17 8 8 8 6 6 6 6 6 6 6 6 6 6 6 1 1 1 1 1 1 1 1 1 1 1 1 1
symmnumber: 1
zpe: 570132.1 jmol-1
zpe.correction: 0.217152 hartree
zpe.thermalcorrener: 0.232787 hartree
zpe.thermalcorrenthalpy: 0.233731 hartree
zpe.thermalcorrgfe: 0.171454 hartree
zpe.sumelectzpe: -1111.552926 hartree
zpe.sumelectthermal: -1111.537292 hartree
zpe.sumelectthermalent: -1111.536348 hartree
zpe.sumelectthermalfe: -1111.598625 hartree
dipole: 0.7683 3.9533 -1.9635
dipole: 4.4804
quadrupole: -88.6219 -94.0838 -95.1673
quadrupole: 7.3887 7.0477 0.1390
quadrupole: 4.0024 -1.4595 -2.5429 7.3887 7.0477 0.1390
hfenergy: -1111.7700783 hartree
pointgroup: C01 [X(C11H13Cl1O3)]
dipole: 0.6781279 1.4924101 -0.6481679 debye
polarizability: 161.432735|12.590928|145.3964811|29.0211926|-14.0747061|106.0413691 unknown
InChI: InChI=1S/C11H13ClO3/c1-8(7-14-2)15-11(13)9-5-3-4-6-10(9)12/h3-6,8H,7H2,1-2H3
charge 0 multiplicity 1
28 atoms
Cl 1.911663 -2.428044 1.837349
O  -1.274084 0.002256 -0.444033
O  -4.076193 0.832284 0.639032
O  -0.526715 -2.131412 0.125353
C  -2.60365 -0.581242 -0.84436
C  -3.624445 0.559732 -0.721537
C  -2.497145 -1.135822 -2.272715
C  0.972777 -0.189641 0.341809
C  -0.304937 -0.903689 0.019874
C  2.024545 -0.769529 1.103169
C  1.171872 1.132534 -0.152938
C  3.22163 -0.067116 1.357076
C  2.363947 1.839412 0.088951
C  3.39473 1.236496 0.846509
C  -3.136087 1.605415 1.457391
H  -2.841993 -1.388461 -0.127879
H  -3.211536 1.476724 -1.198114
H  -4.540872 0.261087 -1.261346
H  -1.711944 -1.907364 -2.327323
H  -3.453782 -1.602489 -2.56986
H  -2.260882 -0.332907 -2.994241
H  0.36443 1.58296 -0.734881
H  4.006338 -0.543275 1.951732
H  2.490289 2.851065 -0.30945
H  4.328563 1.77343 1.043697
H  -3.698326 1.897037 2.35893
H  -2.794028 2.515972 0.921577
H  -2.249067 1.010892 1.745829
