program: Gaussian 09
title: 000222372
version: EM64L-G09RevD.01
frameworkgroup: C1[X(C10H12ClNO2)]
method: RPBEPBE
basis: SDD
operation: Freq
keyword: #p
keyword: freq=noraman
keyword: PBEPBE/SDD
title: #p freq=noraman PBEPBE/SDD
converged: YES YES NO NO
title: Mulliken charges:
elementType: Cl O O N C C C C C C C C C C H H H H H H H H H H H H
charge: -0.079945 -0.318145 -0.255883 -0.427553 0.291009 0.204290 -0.322201 -0.327965 -0.235642 -0.237714 -0.245077 0.241484 -0.684088 -0.670600 0.306273 0.245376 0.364751 0.213327 0.213283 0.228993 0.226278 0.211886 0.234157 0.234091 0.294788 0.294827
chargesum: 0.00000
title: Mulliken charges with hydrogens summed into heavy atoms:
elementType: Cl O O N C C C C C C C C C C
charge: -0.079945 -0.318145 -0.255883 -0.062802 0.291009 0.204290 -0.015927 -0.082589 0.190969 -0.008722 -0.018798 0.241484 -0.003955 -0.080985
polarizability: 1.75278693e+02 -4.36295888e+00 1.66510683e+02 -3.88819028e-02 -6.68802739e-02 6.50516776e+01
1716.lowfreq: -0.0010 0.0009 0.0019 3.8756 4.6379 8.2826 30.7034 63.1515 70.3974
frequency: 30.6685 63.1048 70.3969 82.0585 85.7020 115.6162 139.8778 197.2145 204.3006 243.3560 278.4527 306.7205 319.0939 379.2896 450.5690 456.7561 490.9935 539.1134 582.1077 591.1023 649.9342 680.4620 734.6847 754.4782 766.2750 812.2778 826.4535 844.9021 858.9867 905.0207 908.8675 941.6166 945.5142 985.2331 1038.0844 1041.9709 1107.0829 1118.7815 1139.0066 1149.2273 1175.0057 1197.0690 1221.1854 1255.1320 1259.2852 1262.5264 1306.3889 1369.9433 1396.0912 1403.8466 1419.2527 1444.0601 1462.9675 1472.9477 1481.6277 1494.8946 1529.5732 1597.5118 1609.9044 1610.2520 2964.1003 2999.0805 3023.4268 3068.2418 3096.6605 3107.8945 3136.9328 3149.7897 3155.6524 3170.9738 3192.5141 3433.9989
redmass: 6.5061 4.2233 5.9323 2.6254 3.8739 1.9912 6.2052 6.0380 4.4038 1.2217 6.8656 4.3111 3.7754 9.5612 6.2091 3.2497 5.2327 3.4661 3.5468 6.3863 5.7692 6.4293 3.5759 1.2831 4.4226 1.1700 1.1035 5.6094 1.3638 1.7091 3.2653 1.3496 6.2686 1.3006 2.9673 2.0745 2.2522 2.0669 1.4397 1.1109 1.0577 2.5793 3.1980 1.2097 1.9237 1.1379 1.6661 1.3502 3.9157 1.4337 1.1123 2.4795 1.0392 1.6334 1.2019 1.2422 2.3348 6.0481 5.9208 7.8465 1.0556 1.0364 1.1079 1.0564 1.0989 1.1015 1.0859 1.1093 1.0916 1.0971 1.0957 1.0762
irintensity: 0.5050 0.1390 0.4002 14.0067 5.2772 2.2065 0.8923 8.4306 0.5194 1.2755 1.0069 0.8427 5.8582 2.4704 20.9952 7.8706 11.0096 0.0700 0.1383 5.1204 4.8036 74.1556 0.0032 92.6268 10.0116 80.5020 2.8299 0.5321 2.5032 15.3890 35.1521 7.3710 0.6250 3.0597 62.1230 27.3381 48.8841 27.5630 4.7512 0.4917 2.7932 76.2980 5.3562 44.9475 94.6304 0.0058 15.4663 13.4390 2.5835 37.1060 38.8611 85.6325 12.8459 77.6686 3.6522 11.1340 416.9894 220.8125 8.2883 124.5034 42.0018 18.4217 31.6075 5.9630 28.5573 32.8462 1.9154 1.2297 24.6926 15.3106 5.4033 88.1839
temp: 298.150 k
press: 1.00000 atm
elementType: 17 8 8 7 6 6 6 6 6 6 6 6 6 6 1 1 1 1 1 1 1 1 1 1 1 1
symmnumber: 1
zpe: 534157.0 jmol-1
zpe.correction: 0.203450 hartree
zpe.thermalcorrener: 0.217515 hartree
zpe.thermalcorrenthalpy: 0.218460 hartree
zpe.thermalcorrgfe: 0.160904 hartree
zpe.sumelectzpe: -1052.491271 hartree
zpe.sumelectthermal: -1052.477205 hartree
zpe.sumelectthermalent: -1052.476261 hartree
zpe.sumelectthermalfe: -1052.533816 hartree
dipole: 2.2797 3.3204 0.0095
dipole: 4.0277
quadrupole: -79.9028 -88.4463 -91.8747
quadrupole: 4.0636 -0.0300 0.0111
quadrupole: 6.8385 -1.7051 -5.1334 4.0636 -0.0300 0.0111
hfenergy: -1052.6947202 hartree
pointgroup: C01 [X(C10H12Cl1N1O2)]
dipole: -1.3283297 -0.860821 -0.0743294 debye
dipolederiv: -0.2408579 -0.0807916 -0.0055595 0.1792719 -0.7153554 0.0028568 -0.0021569 -0.011772 -0.1612387 -0.5020501 -0.3620276 -0.0152666 -0.5550358 -1.6615248 -0.0418408 -0.0166835 -0.0312667 -0.2747576 -0.9507556 0.1375329 -0.0301719 -0.6228085 -0.8115707 -0.0378691 -0.0394922 0.0034573 -0.3578649 -1.6886166 0.2620195 -0.0736956 0.0697684 -0.4964532 0.0012508 -0.0770927 0.0120088 -0.2658096 0.7303895 -0.5152022 0.0305071 -0.4841184 0.0216181 -0.0258843 0.0313248 -0.0273872 0.0568024 -0.1505789 0.050279 -0.0100069 0.3602037 1.3106817 0.0303893 -0.0072556 0.0141586 0.0501189 -0.0419498 -0.0317764 0.0052612 0.0670507 -0.0287352 0.0047689 0.0062113 -0.0003964 -0.1473297 0.056148 0.1922341 0.0148816 -0.1083992 -0.2203894 -0.0056606 0.0122644 0.010131 -0.1907043 0.6205685 0.5727669 0.0170154 0.3333786 0.7458703 0.0208548 0.0148282 0.0327333 0.3959043 -0.1797259 0.0826325 0.0008249 -0.0632648 0.0719699 -0.0007256 -0.0005517 0.0068843 -0.1818681 0.0609449 -0.0577978 0.0113021 0.1455309 0.0210078 0.0094749 0.0134308 -0.0013595 -0.1639389 1.9213419 -0.3319059 0.0897305 0.7952063 0.736328 0.0474572 0.1044082 -0.0141254 0.188454 0.0416759 -0.0194964 -0.0004758 -0.003739 -0.1521356 -0.0020614 -0.0005966 -0.0032968 0.0520232 -0.0160704 0.3360215 -0.0052238 -0.0185726 0.751346 0.0073355 -0.0104974 0.0274627 0.1533243 0.0810048 -0.0693046 -0.0058257 -0.0485646 0.125017 -0.0031044 -0.0055938 -0.004364 0.1794171 -0.0491506 -0.0930934 -0.0122787 -0.100754 0.0476204 -0.0065515 -0.0124411 -0.0061397 0.1652191 0.3466649 -0.0133717 0.0027129 -0.0365432 0.2864821 -0.0019609 0.0024187 -0.0007429 0.287161 -0.0861896 -0.0815592 0.0795397 0.0457634 -0.0164345 -0.0726373 0.1140483 -0.0379857 -0.0739312 -0.0659714 -0.0839755 -0.0804426 0.0393556 -0.0183856 0.0780339 -0.1127362 0.0303333 -0.0927676 0.0783117 -0.0102475 -0.004643 0.0141296 -0.1251064 -0.0020944 -0.004374 -0.0034109 0.1643315 -0.0678056 0.1074058 -0.011123 0.0899276 0.0203176 0.0033545 -0.0113796 0.0042833 0.1623521 -0.0786898 -0.1381927 -0.0121897 -0.1030918 -0.0241775 -0.0068563 -0.0118123 -0.0087111 0.1165603 0.0346091 0.0853179 0.1091725 0.0206418 0.083679 -0.0135912 0.1045812 -0.0323166 -0.0451203 0.056999 0.0828099 -0.096421 0.0206079 0.0821153 0.0184124 -0.0929325 0.0444135 -0.0668542 0.0536598 -0.0102046 -0.0588491 -0.0153012 -0.0169076 -0.0235566 -0.0906592 0.0132999 0.0161672 0.0360941 -0.010073 0.0612249 -0.0206431 -0.0168773 0.0202054 0.0927395 -0.0158911 0.0343498 unknown
polarizability: 170.5911102|-6.2323291|170.8958045|5.5503082|0.7311475|65.3541383 unknown
InChI: InChI=1S/C10H12ClNO2/c1-2-14-9-6-4-3-5-8(9)12-10(13)7-11/h3-6,12H,2,7H2,1H3
charge 0 multiplicity 1
26 atoms
Cl 2.783363 -2.70825 0.283616
O  -1.229738 -1.416692 0.088576
O  2.845341 1.371669 0.332924
N  1.080798 -0.190971 0.221192
C  -0.060537 0.653777 0.169046
C  -1.323444 -0.01325 0.096434
C  -0.019099 2.066915 0.185257
C  -2.522355 0.724362 0.040551
C  -2.475366 -2.205747 0.017174
C  -1.225987 2.802644 0.129166
C  -2.468883 2.139369 0.057319
C  2.39939 0.181319 0.296512
C  -2.069832 -3.676798 0.027149
C  3.451722 -0.93154 0.344605
H  0.949705 2.56685 0.241465
H  -3.489151 0.215983 -0.015714
H  0.871281 -1.198661 0.199462
H  -3.113526 -1.954387 0.888478
H  -3.019178 -1.940704 -0.912174
H  -1.187126 3.896702 0.14207
H  -3.400451 2.713547 0.013857
H  -2.969464 -4.315974 -0.028788
H  -1.422111 -3.909501 -0.8351
H  -1.521823 -3.925273 0.951855
H  4.02158 -0.856398 1.282339
H  4.127589 -0.834189 -0.51757
