program: Gaussian 09
title: 000222371
version: EM64L-G09RevD.01
frameworkgroup: C1[X(C10H11ClO3)]
method: RPBEPBE
basis: SDD
operation: Freq
keyword: #p
keyword: freq=noraman
keyword: PBEPBE/SDD
title: #p freq=noraman PBEPBE/SDD
converged: YES YES NO NO
title: Mulliken charges:
elementType: Cl O O O C C C C C C C C C C H H H H H H H H H H H
charge: -0.003046 -0.295224 -0.278089 -0.219814 -0.298761 -0.257458 0.318708 0.195800 -0.279633 -0.316647 -0.215230 -0.227052 -0.210644 -0.495746 0.246198 0.239403 0.230100 0.198930 0.281961 0.261327 0.238585 0.239938 0.235484 0.207967 0.202942
chargesum: 0.00000
title: Mulliken charges with hydrogens summed into heavy atoms:
elementType: Cl O O O C C C C C C C C C C
charge: -0.003046 -0.295224 -0.278089 -0.219814 0.186840 0.171572 0.318708 0.195800 -0.279633 -0.034685 0.046097 0.011534 0.029294 0.150647
polarizability: 1.72374134e+02 -7.81386180e+00 1.40412250e+02 1.33342914e+01 -2.28797644e+00 7.04462222e+01
1716.lowfreq: -10.7233 -7.7758 -3.2824 0.0013 0.0018 0.0022 8.0876 35.2914 49.1401
frequency: 4.4848 35.2693 49.1192 58.6604 91.7579 116.4901 152.8788 188.8024 211.1472 214.6123 229.1661 290.6687 345.1753 366.2134 411.5184 435.4935 463.9889 485.3694 522.2431 638.0708 671.8265 692.9499 745.1652 762.2977 780.7800 829.5503 880.9500 888.6628 933.8216 969.1534 999.1330 1011.4370 1036.8187 1056.9261 1067.7364 1089.3777 1105.7421 1131.4587 1133.2279 1161.2232 1175.4575 1199.0962 1224.8022 1264.2322 1273.5011 1328.6321 1374.4323 1388.3898 1417.8070 1438.3272 1454.0764 1457.7299 1458.5732 1470.0236 1494.9884 1569.0641 1600.1915 1634.6299 2929.0074 2941.8579 3000.6517 3006.1372 3045.8895 3106.7521 3128.8087 3141.7961 3159.5048 3174.9209 3188.8450
redmass: 4.9336 5.2309 4.9555 2.2382 3.1495 4.3324 4.2628 4.2995 7.3399 1.2725 5.1366 4.1345 12.3208 6.5851 3.2722 3.4101 7.8629 4.1844 5.8931 6.4105 4.8628 5.9512 2.4608 4.0496 1.6959 1.3039 1.4042 5.9024 5.8485 1.3753 1.3469 7.5802 3.3003 3.2098 4.7193 4.1282 1.3260 1.5139 1.6178 1.5032 1.0597 1.2010 3.4152 1.4188 1.1236 1.2571 9.6806 1.3628 2.1188 1.1507 1.1731 1.0556 2.1127 1.0587 1.0760 6.4033 6.7928 10.8244 1.0364 1.0541 1.1047 1.1035 1.0578 1.0976 1.1087 1.0867 1.0920 1.0970 1.0965
irintensity: 0.9844 2.4436 1.0897 6.5799 1.2097 0.2525 2.3084 3.3751 0.4564 4.4099 2.5291 8.2620 5.9434 3.5897 7.2684 0.9884 13.7485 9.5183 5.9030 9.0001 19.2932 6.6003 48.1356 20.8534 38.2387 0.6405 0.3449 15.1839 3.7850 2.6124 0.3483 189.9602 32.8039 4.5717 286.6241 11.8120 4.4045 3.9353 22.2427 5.3792 4.5199 40.2662 226.9234 17.0396 2.3468 3.9561 6.1291 8.5957 21.6895 0.3375 21.6618 16.7289 32.0248 14.5030 5.4059 13.1516 28.7033 178.8807 71.1554 60.4795 62.4528 41.8315 27.2793 32.2815 11.1864 3.0056 11.3890 8.1915 6.2261
temp: 298.150 k
press: 1.00000 atm
elementType: 17 8 8 8 6 6 6 6 6 6 6 6 6 6 1 1 1 1 1 1 1 1 1 1 1
symmnumber: 1
zpe: 498289.5 jmol-1
zpe.correction: 0.189788 hartree
zpe.thermalcorrener: 0.204109 hartree
zpe.thermalcorrenthalpy: 0.205053 hartree
zpe.thermalcorrgfe: 0.144268 hartree
zpe.sumelectzpe: -1072.323675 hartree
zpe.sumelectthermal: -1072.309354 hartree
zpe.sumelectthermalent: -1072.308410 hartree
zpe.sumelectthermalfe: -1072.369196 hartree
dipole: 0.8967 -2.7173 2.1110
dipole: 3.5558
quadrupole: -70.9538 -88.0190 -89.5740
quadrupole: -6.9321 -4.3446 2.3410
quadrupole: 11.8951 -5.1701 -6.7250 -6.9321 -4.3446 2.3410
hfenergy: -1072.5134631 hartree
pointgroup: C01 [X(C10H11Cl1O3)]
dipole: -0.3911724 -1.3386606 -0.1098296 debye
dipolederiv: -0.0701327 -0.0584571 0.0418664 -0.0190127 -0.4959794 0.3183932 0.0077397 0.3296197 -0.2601651 -1.5433472 0.2427228 -0.2549409 0.5037821 -0.5623462 0.1667431 -0.4207494 0.1646067 -0.4464859 -1.1393945 0.0136354 0.1915877 0.0139852 -0.4239696 0.0071336 0.2595062 -0.0193875 -0.4538095 -0.7839971 -0.2160207 -0.0212121 -0.0246888 -0.7530242 0.1011165 -0.0584829 0.0990879 -0.3227787 0.8544101 -0.0754747 0.1088365 0.0662295 0.2197877 0.0452865 0.1396324 -0.0232423 0.3023623 0.7143402 0.0333058 0.0131096 0.0033494 0.4043385 -0.0464148 0.047311 0.0173185 0.1235806 -0.6500853 -0.1349293 -0.1006538 -0.1613789 -0.22192 0.1033191 -0.1223277 0.1175807 -0.0781524 2.021869 0.0394771 0.3605189 -0.3302937 1.0596348 -0.2596637 0.5339114 -0.3009702 0.4113659 0.260814 0.294778 -0.1076024 -0.0729489 0.7164174 -0.5669815 0.1276952 -0.4778841 0.3189527 0.0822575 0.0050794 0.0620511 0.1781009 -0.0169561 -0.0113367 -0.0210419 -0.0496689 -0.0733876 -0.1278224 -0.2079307 0.1490309 -0.1395528 -0.2999169 0.0898169 0.0937417 0.0697926 -0.1256066 -0.2442472 0.0975749 -0.090979 0.062463 0.0301592 -0.1148327 -0.0707312 -0.0962377 -0.1137467 0.1259243 0.0202448 0.0750652 0.0534805 0.0686965 -0.1166962 0.0485838 -0.1342514 -0.0156574 0.5296825 -0.0240864 -0.1692095 -0.0599474 0.3634079 0.003528 -0.4082153 0.0052641 0.4246332 -0.0102547 0.0350049 -0.0063339 -0.0537228 -0.0456115 -0.100174 0.0253161 -0.0280247 0.0630167 -0.0039827 0.0152717 -0.0421035 0.0314213 0.0383874 0.1033928 -0.0405055 0.0714659 -0.0235794 -0.0088589 0.0044551 -0.0157157 0.0299105 -0.0238175 0.1133388 -0.0976259 0.0741565 -0.0619224 -0.0424881 -0.0136341 0.0038247 -0.066384 -0.1577812 -0.1011227 -0.046541 -0.0823969 0.0100847 0.1061293 0.0355415 -0.0526874 0.0491524 0.0851538 0.0586851 -0.0678456 0.0508461 0.0954477 0.0338079 0.0224768 -0.0588326 0.0434032 0.0831598 0.0718967 -0.0742646 0.0678899 0.0909965 0.071464 -0.0483549 0.0035914 -0.0686002 -0.0218039 0.1087827 0.012517 0.1142106 0.0872154 -0.0761711 -0.0773315 -0.0234416 -0.0749788 0.0813315 0.0292026 -0.0281722 0.0261964 0.1299973 -0.1718524 -0.0229617 -0.0429149 -0.031428 0.1094679 -0.0147898 -0.0652789 -0.0193188 0.0525515 0.0364389 0.0662594 -0.0332454 0.0144402 -0.0625923 0.1434292 0.1047081 0.1230883 -0.1110741 0.0354968 -0.0466465 0.0103902 0.0532187 -0.1742235 -0.1320527 0.1211194 -0.0997416 -0.0238389 unknown
polarizability: 172.1231199|14.3346344|119.425359|11.06886|-31.0526542|91.6841275 unknown
InChI: InChI=1S/C10H11ClO3/c1-13-6-7-14-10(12)8-4-2-3-5-9(8)11/h2-5H,6-7H2,1H3
charge 0 multiplicity 1
25 atoms
Cl -1.843389 2.097154 -1.769559
O  1.023065 -0.508539 0.754688
O  4.674333 -0.153825 0.229344
O  0.638073 1.589905 -0.183685
C  2.42917 -0.104947 1.021523
C  3.293631 -0.330804 -0.224441
C  -1.193591 -0.048537 -0.006403
C  0.204602 0.463636 0.147144
C  -2.181582 0.598272 -0.799373
C  -1.578723 -1.235282 0.683934
C  -3.494524 0.090487 -0.895499
C  -2.886267 -1.746956 0.598654
C  -3.849596 -1.080513 -0.193617
C  5.637027 -0.282143 -0.863144
H  2.461636 0.952805 1.331685
H  2.759612 -0.761644 1.840589
H  3.037451 0.403789 -1.016194
H  3.136821 -1.358982 -0.618556
H  -0.821075 -1.738153 1.289263
H  -4.226573 0.612928 -1.51784
H  -3.153353 -2.657094 1.144821
H  -4.871781 -1.465948 -0.270024
H  6.631833 -0.128915 -0.416645
H  5.463195 0.482924 -1.649113
H  5.591902 -1.29022 -1.327954
