program: Gaussian 09
title: 000222370
version: EM64L-G09RevD.01
frameworkgroup: C1[X(C10H10Cl2O2)]
method: RPBEPBE
basis: SDD
operation: Freq
keyword: #p
keyword: freq=noraman
keyword: PBEPBE/SDD
title: #p freq=noraman PBEPBE/SDD
converged: YES YES NO NO
title: Mulliken charges:
elementType: Cl Cl O O C C C C C C C C C C H H H H H H H H H H
charge: -0.049584 -0.029519 -0.259706 -0.258662 0.071827 -0.609460 -0.690807 0.328642 0.219216 -0.260796 -0.331117 -0.215231 -0.228316 -0.211441 0.267097 0.255197 0.279092 0.218945 0.228377 0.259077 0.276759 0.259426 0.240960 0.240023
chargesum: 0.00000
title: Mulliken charges with hydrogens summed into heavy atoms:
elementType: Cl Cl O O C C C C C C C C C C
charge: -0.049584 -0.029519 -0.259706 -0.258662 0.338924 -0.075171 0.015591 0.328642 0.219216 -0.260796 -0.054357 0.044195 0.012644 0.028582
polarizability: 1.65100493e+02 -8.91440626e+00 1.32436823e+02 2.20352314e+01 -3.85867197e+00 9.44885142e+01
1716.lowfreq: -5.7378 0.0011 0.0016 0.0019 4.4591 9.7781 11.2344 37.4353 48.9636
frequency: 10.4146 37.3694 48.9174 76.1889 104.6964 133.3104 174.9078 200.3327 209.8858 228.9477 275.2346 298.1401 345.4835 401.7906 414.7641 426.6444 461.1331 487.6337 520.2969 633.7199 673.4394 690.3519 700.3670 743.8678 774.7192 785.8675 825.8443 882.9358 893.1895 927.5272 970.3241 999.8253 1014.6080 1026.1060 1033.9262 1086.7861 1099.2785 1123.2155 1137.5134 1174.9187 1199.4295 1238.6783 1263.1461 1272.6853 1324.2448 1335.0704 1371.9476 1386.9679 1420.3028 1433.2784 1457.9700 1464.3247 1477.2174 1564.9327 1601.2010 1602.1870 2995.0210 3047.9170 3063.1886 3093.5410 3108.5136 3142.1537 3148.2196 3155.5552 3168.8162 3179.0821
redmass: 8.0848 8.8973 10.8976 5.3806 4.0087 3.9163 3.3555 2.2004 1.9240 4.1980 6.4342 6.3870 4.0285 3.4629 5.7801 5.0871 3.8662 4.0103 4.6932 6.6123 4.9646 5.3395 6.9623 2.6571 2.1661 2.2629 6.3052 1.3973 1.5579 1.8380 1.3738 1.3514 7.6504 1.9139 2.9456 2.0160 2.8354 1.8220 1.5921 1.0577 1.4438 2.2653 1.3151 1.5136 1.3837 1.4458 8.8410 1.2064 2.2328 1.1080 2.3460 1.0747 1.0459 6.6881 10.5287 6.7337 1.0357 1.0857 1.0574 1.0993 1.1006 1.0863 1.1104 1.0904 1.0951 1.1004
irintensity: 0.9759 2.6335 1.6262 1.3284 2.4967 1.0099 0.9066 0.1655 0.8061 1.2245 2.3954 2.7772 4.9080 10.8842 13.7383 3.7647 2.0165 11.5648 1.1657 4.0278 20.6954 24.5115 16.9174 41.3293 29.4401 21.4898 9.0632 0.3181 1.7756 13.8292 2.4593 1.4484 42.0464 29.9529 80.5708 0.7653 207.9287 1.8513 42.6622 1.5898 5.7967 215.4505 25.8844 110.7779 2.5302 11.0891 5.5378 23.1088 53.5964 10.7623 10.4202 12.9704 11.9236 10.4010 197.6895 45.1812 15.9128 5.7826 15.5964 26.0812 11.6565 2.9736 10.8290 4.3691 5.6899 15.2370
temp: 298.150 k
press: 1.00000 atm
elementType: 17 17 8 8 6 6 6 6 6 6 6 6 6 6 1 1 1 1 1 1 1 1 1 1
symmnumber: 1
zpe: 463971.7 jmol-1
zpe.correction: 0.176717 hartree
zpe.thermalcorrener: 0.190817 hartree
zpe.thermalcorrenthalpy: 0.191761 hartree
zpe.thermalcorrgfe: 0.132557 hartree
zpe.sumelectzpe: -1456.602520 hartree
zpe.sumelectthermal: -1456.588420 hartree
zpe.sumelectthermalent: -1456.587476 hartree
zpe.sumelectthermalfe: -1456.646680 hartree
dipole: 1.1669 0.8755 -1.3410
dipole: 1.9815
quadrupole: -74.4737 -97.3510 -99.6492
quadrupole: -3.7290 12.6837 -2.7573
quadrupole: 16.0176 -6.8597 -9.1579 -3.7290 12.6837 -2.7573
hfenergy: -1456.7792372 hartree
pointgroup: C01 [X(C10H10Cl2O2)]
dipole: -0.4093358 0.0841481 -0.6581304 debye
dipolederiv: -0.1873591 0.0143694 0.0062572 0.0572878 -0.2924882 0.1521312 -0.0609979 0.2191986 -0.4657068 -0.2633902 0.1813326 0.2432152 0.156135 -0.2597004 -0.2335081 0.2384779 -0.2568826 -0.3548551 -1.6847013 0.229953 0.1659309 0.4785472 -0.5581587 -0.0672047 0.2383028 -0.0598173 -0.3097318 -0.7844039 -0.2133462 -0.0653969 0.0139263 -0.8715941 -0.1721578 0.0235623 -0.2042191 -0.3730151 1.0360501 -0.1031932 -0.02619 0.1022779 0.1979597 -0.0662176 -0.0132692 -0.0365289 0.1852857 0.1139913 0.0060272 0.0106324 -0.0165503 0.2649172 -0.226106 0.0806224 -0.2487417 0.6001225 -0.135438 0.1074262 -0.0495027 0.0052535 -0.060744 0.1470338 0.0213257 0.0911713 -0.0462907 -0.6302283 -0.1020605 0.0569674 -0.1332 -0.1890993 -0.119391 0.0947944 -0.1155347 -0.0984411 2.0690317 0.179353 0.0038256 -0.3742723 1.1625685 0.3004088 -0.2939903 0.3169551 0.3265091 0.4936789 -0.3059583 -0.4458265 0.0013599 0.3395515 0.3787186 -0.2559308 0.4318112 0.453441 0.1049897 0.0980161 0.0184728 -0.0979368 -0.0457736 0.064176 -0.0716822 0.0328903 -0.0599064 -0.3264073 0.1365839 0.1852357 0.094079 -0.059507 0.0115813 0.1427607 -0.0086676 -0.1628341 -0.0814091 -0.1415211 -0.1452894 -0.0983398 -0.1283157 0.0507421 -0.1118359 0.0639836 -0.07252 0.1297482 0.0629988 -0.0263555 0.0136916 0.0308863 0.1295817 -0.0689051 0.1221155 -0.0028004 -0.0069202 0.0274018 0.0215461 -0.08769 0.037593 -0.0461499 -0.0225717 -0.0424437 -0.0191828 -0.1077353 -0.0206048 0.0391414 -0.0377598 0.0657755 0.0600431 0.0255753 0.0541181 -0.003359 0.121987 -0.0595365 -0.0434547 -0.0076337 0.0013425 -0.0004572 -0.0283332 -0.0347905 -0.076018 -0.1602038 -0.0761356 0.0172072 -0.0842667 0.1042536 0.0021712 0.0238469 -0.0058212 0.0809898 0.1209711 -0.0393221 -0.0237977 -0.0167463 0.0007381 -0.1311612 -0.0015642 -0.0604139 -0.0269619 0.0646837 0.103181 -0.0242173 0.1056156 -0.0239791 0.0507858 -0.0327119 0.02361 0.0564318 0.1213589 -0.037213 -0.0184309 -0.0081781 0.0621011 -0.0771451 -0.0207339 -0.0636152 0.0984947 0.0805979 -0.0330719 -0.0043852 -0.0563285 0.0439165 -0.0870781 -0.0165415 -0.0964965 0.0827717 0.0003162 0.0419873 0.0802794 0.0526874 0.076905 -0.0886904 0.0913977 -0.0902834 0.0630634 -0.0892082 -0.0566672 0.0241355 -0.0619589 0.1008517 -0.0321065 0.0184017 -0.0315973 0.1245137 unknown
polarizability: 168.4836724|3.345667|113.0882449|-17.8951783|20.5785249|110.4539127 unknown
InChI: InChI=1S/C10H10Cl2O2/c1-7(6-11)14-10(13)8-4-2-3-5-9(8)12/h2-5,7H,6H2,1H3
charge 0 multiplicity 1
24 atoms
Cl 3.358516 -1.586578 1.849144
Cl -0.505358 -1.704579 -1.776375
O  1.308838 -0.092473 -0.135304
O  0.639942 1.987481 0.666152
C  2.737553 0.354217 -0.102257
C  3.555479 -0.914583 0.100681
C  3.073633 1.052278 -1.431783
C  -1.046865 0.299978 0.198077
C  0.353245 0.832604 0.25769
C  -1.532639 -0.779114 -0.588262
C  -1.982805 0.98331 1.027946
C  -2.886559 -1.174399 -0.530467
C  -3.332209 0.594975 1.098104
C  -3.785207 -0.494653 0.318614
H  2.859652 1.055624 0.742426
H  4.630174 -0.7135 -0.022156
H  3.223539 -1.719114 -0.57152
H  4.123109 1.398409 -1.429184
H  2.924569 0.371043 -2.28759
H  2.424618 1.933767 -1.562726
H  -1.605241 1.828726 1.611947
H  -3.228851 -2.00641 -1.152361
H  -4.023992 1.134356 1.752473
H  -4.832142 -0.813069 0.36023
