program: Gaussian 09
title: 000222369
version: EM64L-G09RevD.01
frameworkgroup: C1[X(C10H9ClO4)]
method: RPBEPBE
basis: SDD
operation: Freq
keyword: #p
keyword: freq=noraman
keyword: PBEPBE/SDD
title: #p freq=noraman PBEPBE/SDD
converged: YES YES NO NO
title: Mulliken charges:
elementType: Cl O O O O C C C C C C C C C C H H H H H H H H H
charge: -0.021628 -0.302733 -0.288495 -0.266692 -0.163154 0.128595 0.293903 -0.310694 -0.348588 -0.230384 -0.197216 0.214183 0.328760 -0.690776 -0.498561 0.279192 0.259129 0.237978 0.239463 0.288459 0.322089 0.248909 0.243082 0.235179
chargesum: 0.00000
title: Mulliken charges with hydrogens summed into heavy atoms:
elementType: Cl O O O O C C C C C C C C C C
charge: -0.021628 -0.302733 -0.288495 -0.266692 -0.163154 0.128595 0.293903 -0.031502 -0.089459 0.007595 0.042248 0.214183 0.328760 -0.080229 0.228608
polarizability: 1.65927923e+02 -1.20621463e+01 1.47277527e+02 5.77980012e+00 2.33111213e+00 7.63064560e+01
1716.lowfreq: -0.0021 -0.0020 -0.0012 4.4297 6.0253 9.0682 25.0488 38.8299 63.7082
frequency: 24.9493 38.8115 63.7013 89.4027 91.3849 92.9575 119.4805 165.8371 171.1286 208.5808 240.3336 275.1996 298.2776 328.7105 402.2966 437.1018 478.2246 496.5315 525.8744 558.4959 643.6462 656.5215 681.5718 723.1635 748.7446 770.0936 782.3131 794.1323 877.1021 892.4170 914.0820 925.1401 973.3425 1001.1786 1036.7841 1045.9575 1056.8290 1114.5099 1121.7739 1149.3741 1153.0496 1174.5174 1183.5864 1246.0104 1272.0387 1284.6699 1385.0166 1420.9781 1423.3077 1432.8009 1451.8641 1463.1655 1471.3447 1575.3507 1606.7942 1621.7587 1712.7760 3006.8383 3067.0194 3109.6126 3142.7152 3152.1083 3152.3360 3160.1980 3176.4162 3187.7245
redmass: 6.2231 9.0437 7.1251 1.7498 3.4322 2.0354 3.8865 4.4022 4.4485 8.1542 7.7054 6.2020 8.2198 4.6813 10.4361 3.5451 4.0880 4.1692 4.4970 9.1641 6.2237 5.7426 4.3505 6.5971 4.6429 4.9151 1.9777 3.0522 3.9603 1.7760 1.7928 7.5413 1.3782 1.3438 2.6055 3.8771 4.1233 1.2628 1.9881 1.4867 1.1565 1.0767 2.7036 3.6722 1.4804 1.3957 10.5655 1.0869 1.2536 2.0812 1.0500 1.0522 2.6120 6.8484 7.9472 8.3268 11.6770 1.0295 1.0571 1.1046 1.0867 1.1049 1.1071 1.0920 1.0964 1.0972
irintensity: 1.3479 1.1352 1.6154 4.0817 2.6784 4.3568 0.6012 5.7271 4.7401 0.8626 0.8990 2.1480 4.4316 18.2683 3.4217 1.0764 4.9897 13.1363 6.3304 4.1328 6.9451 7.2661 22.7014 46.9351 12.4831 6.5276 23.9794 41.6372 114.6625 26.0276 7.6316 2.9619 3.3215 0.1269 38.0792 359.0799 189.7617 0.0504 57.7009 58.9544 18.5775 5.7893 52.3552 246.4573 27.9123 27.8492 2.9817 45.7553 25.3740 14.6953 15.0429 13.9422 53.1070 16.9074 76.3985 224.7133 140.7000 33.7818 5.8357 23.1084 2.8168 15.0727 1.2235 14.4577 5.9184 7.1880
temp: 298.150 k
press: 1.00000 atm
elementType: 17 8 8 8 8 6 6 6 6 6 6 6 6 6 6 1 1 1 1 1 1 1 1 1
symmnumber: 1
zpe: 448898.4 jmol-1
zpe.correction: 0.170976 hartree
zpe.thermalcorrener: 0.185728 hartree
zpe.thermalcorrenthalpy: 0.186672 hartree
zpe.thermalcorrgfe: 0.126796 hartree
zpe.sumelectzpe: -1146.319115 hartree
zpe.sumelectthermal: -1146.304364 hartree
zpe.sumelectthermalent: -1146.303420 hartree
zpe.sumelectthermalfe: -1146.363295 hartree
dipole: 4.3796 0.2588 -1.9331
dipole: 4.7942
quadrupole: -91.6740 -73.7585 -98.0256
quadrupole: -0.2003 7.3274 1.4264
quadrupole: -3.8546 14.0609 -10.2063 -0.2003 7.3274 1.4264
hfenergy: -1146.4900914 hartree
pointgroup: C01 [X(C10H9Cl1O4)]
dipole: -1.7410147 -0.0331937 -0.7249328 debye
dipolederiv: -0.4820645 0.0348065 -0.0581604 0.0031459 -0.1347016 0.001803 -0.1506003 0.0108208 -0.1678303 -1.9435057 0.3116199 -0.2166867 0.5977395 -0.4421059 0.1628199 -0.1144226 0.1171133 -0.5218703 -0.7023774 -0.5760094 0.1030583 -0.3369742 -1.4099256 0.1058229 0.13208 0.2159318 -0.3267228 -0.9665283 -0.00159 0.1485835 0.180783 -0.7203661 -0.0691036 0.162869 -0.0233704 -0.32897 -0.5728708 0.0623327 0.1159614 0.144704 -0.3150893 -0.0180441 -0.3664108 0.0432301 -0.8389206 -0.2363876 0.1874839 0.0131744 0.0791195 -0.6719622 0.0098865 0.0986149 -0.0312041 -0.0135701 1.1733979 -0.0073324 -0.0252151 -0.2868628 0.3961745 0.0328349 -0.3725402 0.0068488 0.0513713 -0.0162003 -0.1680422 -0.0320657 0.0602426 0.1281709 -0.036177 -0.0319046 0.0279259 -0.0781747 -0.3429272 0.1734876 -0.0417589 0.289694 -0.1160919 -0.0558978 0.0090533 -0.0487795 -0.117941 0.0705966 -0.0678162 -0.0793026 -0.1252287 -0.2614086 0.0220754 -0.0667864 0.0248229 -0.1404334 0.1427555 -0.0210096 -0.0534599 -0.0036184 0.1554237 -0.0097782 -0.0801534 -0.0129153 -0.1016252 1.291359 0.3645026 -0.2634455 0.0325914 1.8844567 -0.0329081 -0.3004856 -0.171693 0.3230005 1.7129508 -0.3294623 0.109332 -0.7488425 0.5351321 -0.1241707 0.5830004 -0.1333037 1.1848651 0.4846661 0.0289151 0.2241961 0.1668363 0.0587976 -0.0949631 0.443492 -0.1008873 0.0806155 0.2201115 0.0034752 0.0087981 0.1115314 0.7608673 -0.0338414 0.0051514 -0.0211957 0.2693473 0.0562705 -0.0620387 0.0257715 -0.0634303 0.0708972 0.0270082 0.0346424 0.027397 0.1447589 0.0439664 -0.0780807 0.0484028 -0.0683169 0.0281749 0.0208675 0.038776 0.0288911 0.1494694 -0.0820107 0.0539885 0.0641754 0.0350212 0.0727062 -0.003307 0.0700606 -0.0071966 0.1436919 0.0683675 0.0620562 0.0130948 0.0714037 -0.0829265 0.0047384 0.0219206 0.0055717 0.150512 -0.005881 0.0164262 -0.0474392 -0.0276652 0.0739909 0.0918375 -0.0405828 0.0680425 0.0120165 0.0267662 -0.0232671 -0.0512092 -0.0145475 0.0383131 -0.0233341 -0.0738534 -0.0140346 0.1021779 0.0067027 0.0858523 -0.1149761 -0.0235191 -0.02148 0.0029703 -0.0858786 0.0243324 0.0058644 0.0977415 0.0698762 0.0549741 -0.0165002 -0.0324375 -0.0025716 0.0309481 -0.078296 -0.0874355 -0.0448989 -0.1201743 0.0541969 -0.0573067 0.0053901 0.0214322 0.05301 0.0419477 0.1058034 unknown
polarizability: 164.3003166|-13.2865046|148.4313028|-7.2247697|-4.1819081|76.780286 unknown
InChI: InChI=1S/C10H9ClO4/c1-14-10(13)7-4-2-3-5-8(7)15-9(12)6-11/h2-5H,6H2,1H3
charge 0 multiplicity 1
24 atoms
Cl 4.831889 -0.186129 0.27395
O  1.120996 0.91193 -0.743197
O  -1.652432 -2.263889 0.304468
O  0.519462 -1.786551 -0.357873
O  1.925093 0.324781 1.390355
C  -1.079834 0.039549 0.033427
C  -0.214336 1.121416 -0.298901
C  -2.418295 0.349457 0.401026
C  -0.667637 2.453938 -0.280851
C  -2.877508 1.679838 0.428349
C  -2.001577 2.735512 0.080997
C  -0.62581 -1.379271 -0.033539
C  2.077365 0.35882 0.165942
C  3.233087 -0.138659 -0.678261
C  -1.288307 -3.700128 0.279406
H  -3.085523 -0.476772 0.65803
H  0.033488 3.250143 -0.546975
H  -3.911678 1.894219 0.715647
H  -2.351446 3.773054 0.09706
H  3.383051 0.502442 -1.556852
H  3.00209 -1.169242 -0.988905
H  -0.463985 -3.895594 0.985304
H  -0.975093 -3.996967 -0.735478
H  -2.20486 -4.224996 0.582169
