program: Gaussian 09
title: 000222368
version: EM64L-G09RevD.01
frameworkgroup: C1[X(C9H9ClO2)]
method: RPBEPBE
basis: SDD
operation: Freq
keyword: #p
keyword: freq=noraman
keyword: PBEPBE/SDD
title: #p freq=noraman PBEPBE/SDD
converged: YES YES NO NO
title: Mulliken charges:
elementType: Cl O O C C C C C C C C C H H H H H H H H H
charge: -0.009157 -0.295534 -0.189917 0.469395 0.377307 -0.453074 -0.439637 -0.406751 -0.182697 -0.801376 0.313658 -0.690664 0.300196 0.236157 0.257083 0.231631 0.236394 0.236353 0.222796 0.293918 0.293919
chargesum: 0.00000
title: Mulliken charges with hydrogens summed into heavy atoms:
elementType: Cl O O C C C C C C C C C
charge: -0.009157 -0.295534 -0.189917 0.469395 0.377307 -0.152878 -0.203480 -0.149668 0.048935 -0.105834 0.313658 -0.102827
polarizability: 1.62283931e+02 6.08646309e+00 1.19380066e+02 -1.62960190e-02 -2.45395666e-02 5.29173301e+01
1716.lowfreq: -10.4475 -3.7110 -3.1316 -0.0010 0.0015 0.0026 21.8712 22.3631 29.6372
frequency: 21.6441 21.8416 29.5853 63.5878 88.4216 204.1865 214.5628 242.2705 245.7456 300.5851 386.4688 438.4990 513.2911 520.7190 538.6554 564.1380 665.5871 693.3154 700.8637 759.8722 792.4813 859.3533 894.3093 912.1395 925.0016 929.1129 980.3935 986.6940 1001.3834 1050.4967 1092.0444 1099.5016 1129.7970 1150.3090 1174.5340 1240.2669 1279.1993 1302.0782 1381.1285 1397.7285 1421.4972 1424.7232 1468.6701 1475.3479 1481.9270 1597.1464 1610.0553 1677.0261 2981.9662 3059.1037 3061.9448 3090.2953 3131.8228 3134.6368 3152.3077 3174.6505 3194.7280
redmass: 1.2060 5.4558 3.0721 3.8675 7.0273 3.1101 5.4671 10.1137 4.8143 6.9337 3.2060 2.8667 5.1055 3.0159 10.0457 3.8105 7.6468 2.2570 6.9909 6.8832 1.4210 6.4669 1.2957 1.7737 1.3804 3.6627 1.3403 5.6129 1.5870 1.5645 1.5492 3.3837 2.1463 1.1052 1.1112 3.4437 1.3968 1.2951 6.5556 1.2703 1.0883 2.5429 1.0453 1.5355 1.6243 6.1525 6.6388 10.9466 1.0371 1.0570 1.0977 1.0992 1.0876 1.1075 1.0930 1.0980 1.0928
irintensity: 1.2633 0.4637 4.2116 6.0999 1.6295 1.5427 0.8294 0.5370 0.4668 4.2717 1.9293 6.4246 2.2658 0.8415 9.3310 0.3852 9.3236 22.9820 8.3601 25.7592 61.8704 8.2111 1.5768 9.9841 14.1633 48.3287 0.2705 2.4441 3.4603 15.5591 7.0157 453.3181 218.2609 0.1598 0.4381 70.3439 21.3843 5.2888 3.1186 16.9893 29.1483 30.3835 13.8881 11.9338 62.5300 47.0409 23.6498 160.4799 26.2814 9.1546 17.8757 19.5854 7.8111 1.2995 21.1609 7.8747 3.2527
temp: 298.150 k
press: 1.00000 atm
elementType: 17 8 8 6 6 6 6 6 6 6 6 6 1 1 1 1 1 1 1 1 1
symmnumber: 1
zpe: 412290.8 jmol-1
zpe.correction: 0.157033 hartree
zpe.thermalcorrener: 0.169141 hartree
zpe.thermalcorrenthalpy: 0.170085 hartree
zpe.thermalcorrgfe: 0.114818 hartree
zpe.sumelectzpe: -957.985077 hartree
zpe.sumelectthermal: -957.972969 hartree
zpe.sumelectthermalent: -957.972024 hartree
zpe.sumelectthermalfe: -958.027292 hartree
dipole: -2.6838 -2.2497 0.0164
dipole: 3.5020
quadrupole: -74.8739 -72.6237 -78.5703
quadrupole: -7.8147 0.0487 -0.0085
quadrupole: 0.4821 2.7323 -3.2143 -7.8147 0.0487 -0.0085
hfenergy: -958.1421099 hartree
pointgroup: C01 [X(C9H9Cl1O2)]
dipole: -0.9288384 1.017165 -0.0309283 debye
dipolederiv: -0.3938482 0.1149195 -0.0224953 0.1936243 -0.2074819 0.0176452 -0.0169858 0.0081966 -0.133191 -2.0781061 0.5418947 -0.1796994 0.7862154 -0.7173977 0.0476353 -0.157749 0.0183139 -0.2009056 -0.5952112 -0.1320766 -0.0495184 0.4214636 -0.8910932 -0.0027511 -0.0009286 -0.0688113 -0.2788353 0.1208543 0.1611734 0.0309744 0.2317788 0.3450386 0.0593962 0.0372379 0.051312 -0.0115398 1.3386103 -0.2266028 0.1279496 -0.0560615 0.2002089 0.0012971 0.1427346 -0.0190508 0.1214962 -0.365295 -0.1087637 -0.031804 -0.1070164 -0.1613918 -0.0113153 -0.031392 -0.011803 -0.182241 0.0142487 0.0055671 0.0243174 -0.1334192 -0.2299966 -0.0199967 0.012174 -0.0033235 -0.1828899 -0.3090075 0.0771786 -0.0071383 0.1155532 -0.0731968 0.0240921 -0.0037279 0.0195235 -0.1918818 0.1149533 -0.0317861 0.0268625 -0.0309655 0.136704 0.0194897 0.0267896 0.0193845 -0.1268877 0.0474188 -0.0413483 -0.0047808 -0.112796 -0.1426356 -0.0307996 -0.0114678 -0.0228252 0.0533185 1.8023931 -0.24542 0.1667668 -0.9109596 1.3328448 -0.0117456 0.1049676 0.0677349 0.2333519 0.2162416 -0.2996154 -0.0150362 -0.5887584 0.2423398 -0.0642957 -0.035676 -0.0297405 0.1477553 0.1627622 0.0351887 0.001548 0.0346411 0.0377986 -0.0076673 0.0015012 -0.0075603 0.1744971 -0.1255633 0.0091159 -0.0335052 -0.0136151 0.0926489 -0.0074576 -0.0353077 -0.0047551 0.1558971 0.0551956 -0.0854332 -0.022151 -0.0825784 0.0088049 -0.024512 -0.0218056 -0.0248273 0.1737236 0.0301203 0.0872159 -0.0075789 0.0851737 -0.0811572 -0.0102558 -0.0077953 -0.0100308 0.1543254 0.0538474 0.009442 0.0765418 -0.0189202 0.0143109 -0.0896923 0.0225187 -0.1198595 -0.0442631 0.0719812 -0.0080076 -0.0533322 -0.0375337 -0.0227904 0.0885472 -0.0041356 0.1256714 -0.0249696 -0.1513373 -0.0127153 -0.0317546 0.0885614 0.0658792 0.0066007 -0.0229663 -0.005199 0.1063863 -0.0042066 0.08307 0.0118855 0.0770417 0.0362322 -0.061951 -0.0095819 -0.0626462 0.0172648 -0.0060516 0.0670032 -0.0080518 0.0585711 0.0143305 0.0777364 0.0115958 0.0802958 0.0395887 unknown
polarizability: 158.5718434|-12.2019704|121.3191273|11.6551819|4.3676122|54.6903563 unknown
InChI: InChI=1S/C9H9ClO2/c1-7-3-2-4-8(5-7)12-9(11)6-10/h2-5H,6H2,1H3
charge 0 multiplicity 1
21 atoms
Cl 4.762553 -1.243614 0.618288
O  1.164669 0.540067 0.334778
O  1.752378 -1.745711 0.207985
C  -2.396024 -0.668523 -0.195992
C  -0.259284 0.457198 0.157484
C  -0.985837 -0.736966 -0.032633
C  -3.037245 0.59373 -0.164127
C  -0.890668 1.719875 0.190667
C  -2.288375 1.779012 0.02799
C  -3.188746 -1.948232 -0.401563
C  2.050695 -0.549324 0.345608
C  3.437917 0.053829 0.559266
H  -0.474535 -1.700938 -0.054363
H  -4.124451 0.650298 -0.289495
H  -0.287078 2.619545 0.340571
H  -2.794489 2.749956 0.051044
H  -2.852535 -2.485377 -1.307826
H  -3.059372 -2.640091 0.451355
H  -4.267017 -1.742266 -0.510148
H  3.466387 0.603482 1.511947
H  3.680057 0.74045 -0.265739
