program: Gaussian 09
title: 000222367
version: EM64L-G09RevD.01
frameworkgroup: C1[X(C8H16N2O2)]
method: RPBEPBE
basis: SDD
operation: Freq
keyword: #p
keyword: freq=noraman
keyword: PBEPBE/SDD
title: #p freq=noraman PBEPBE/SDD
converged: YES YES NO NO
title: Mulliken charges:
elementType: O O N N C C C C C C C C H H H H H H H H H H H H H H H H
charge: -0.247594 -0.275730 -0.096407 -0.342190 -0.350386 -0.340011 -0.312510 -0.312056 -0.318752 -0.394618 0.231522 -0.785448 0.207181 0.192702 0.198586 0.217121 0.191044 0.216164 0.212626 0.190763 0.191990 0.215950 0.252880 0.229848 0.298367 0.264714 0.233045 0.231197
chargesum: 0.00000
title: Mulliken charges with hydrogens summed into heavy atoms:
elementType: O O N N C C C C C C C C
charge: -0.247594 -0.275730 -0.096407 -0.043823 0.049498 0.075696 0.094698 0.091333 0.089188 0.088110 0.231522 -0.056492
polarizability: 1.29586823e+02 1.58231268e+00 1.04596398e+02 -3.30029469e+00 -2.27728290e+00 8.20059287e+01
1716.lowfreq: -102.3048 -19.2273 -10.9185 -0.0010 -0.0009 -0.0006 8.5099 21.8958 25.0934
frequency: -102.3027 19.9026 24.3413 55.0460 82.4871 120.3673 220.0212 233.3916 261.7333 278.4416 320.3868 364.9076 395.7664 417.0827 466.4870 487.7081 530.4103 588.8438 596.6514 628.0140 766.3457 767.2616 807.0759 839.5349 873.5718 898.8185 958.6731 998.3323 1027.4356 1031.0373 1039.6489 1052.2630 1065.9658 1089.8874 1100.3106 1109.9445 1137.0926 1162.0257 1189.3102 1217.8815 1256.0446 1263.2269 1272.3896 1295.0761 1301.1741 1319.8507 1333.5904 1349.1441 1367.5934 1371.6454 1374.0003 1389.8574 1440.6208 1442.0411 1446.1819 1449.5726 1452.8407 1457.3371 1467.6779 1475.8380 1491.9199 1627.6394 2864.8641 2875.7515 2895.4695 2952.6819 2958.1706 2988.7340 3014.3738 3021.7461 3025.4410 3046.2389 3074.4526 3079.6805 3084.5688 3091.8869 3133.9403 3551.7552
redmass: 1.0600 3.6260 5.0163 3.8833 3.2158 3.2557 3.1659 1.8358 3.0168 3.1380 2.4489 2.7638 2.1076 3.6599 2.7606 3.4486 1.4531 2.0573 2.5428 2.6872 1.5209 2.8582 3.7954 1.6099 2.7288 2.3302 1.7436 2.7823 2.2474 1.6793 3.8480 2.0229 2.1315 3.2635 2.7616 2.5147 2.5852 2.4424 1.0662 1.2408 2.0625 1.3569 1.3326 1.2969 1.1634 1.3131 1.2346 1.3161 1.3316 1.2733 1.2886 1.3781 1.1593 1.0832 1.0923 1.0953 1.0642 1.0990 1.0475 1.0957 1.7214 6.1391 1.0700 1.0699 1.0680 1.0665 1.0666 1.0380 1.0903 1.0616 1.0896 1.0896 1.0983 1.0963 1.0976 1.1037 1.0981 1.0779
irintensity: 0.0601 3.2433 5.6602 3.4414 1.9879 2.0981 10.9898 1.7213 2.2489 1.5155 14.6785 2.7795 1.0113 12.1881 1.1526 11.7033 111.1013 10.8839 6.6874 1.4210 4.5275 5.8723 21.9931 0.3627 3.8544 9.0555 5.5849 25.5126 8.9360 6.7064 11.0360 16.6335 7.5012 41.4863 4.0171 3.7039 65.6896 14.5384 1.1246 9.3324 108.3317 14.3646 10.6469 2.6906 13.1010 2.9759 2.6348 7.0133 0.3468 2.9063 50.1414 7.3604 69.8908 1.1396 18.7885 25.1100 6.9080 8.2584 20.0390 10.2545 149.5784 163.8222 60.1001 64.7343 100.0499 39.5614 101.8028 11.0221 16.0882 31.7036 63.3833 33.7912 18.3187 42.6399 33.5373 13.8310 8.6217 13.2382
temp: 298.150 k
press: 1.00000 atm
elementType: 8 8 7 7 6 6 6 6 6 6 6 6 1 1 1 1 1 1 1 1 1 1 1 1 1 1 1 1
symmnumber: 1
zpe: 631206.1 jmol-1
zpe.correction: 0.240414 hartree
zpe.thermalcorrener: 0.252789 hartree
zpe.thermalcorrenthalpy: 0.253733 hartree
zpe.thermalcorrgfe: 0.199388 hartree
zpe.sumelectzpe: -573.406588 hartree
zpe.sumelectthermal: -573.394213 hartree
zpe.sumelectthermalent: -573.393269 hartree
zpe.sumelectthermalfe: -573.447614 hartree
dipole: 1.9604 -4.4201 0.9992
dipole: 4.9375
quadrupole: -77.2886 -71.3150 -73.7433
quadrupole: -8.0584 0.2296 1.6948
quadrupole: -3.1730 2.8007 0.3723 -8.0584 0.2296 1.6948
hfenergy: -573.647002 hartree
pointgroup: C01 [X(C8H16N2O2)]
dipole: 0.8823709 1.7305839 0.0026656 debye
polarizability: 128.8800824|-3.8539827|104.9517559|4.980713|2.036177|82.357311 unknown
InChI: InChI=1S/C8H16N2O2/c1-8(11)9-2-3-10-4-6-12-7-5-10/h9H,2-7H2,1H3
charge 0 multiplicity 1
28 atoms
O  -3.979579 -0.404611 0.080961
O  2.868936 -1.730881 0.256835
N  -1.1960 0.429902 0.027103
N  2.605502 0.541641 -0.157399
C  -2.219893 1.20728 0.771984
C  -1.571366 -1.009788 -0.000741
C  0.185628 0.657174 0.507756
C  -3.596513 1.016313 0.11259
C  -2.956181 -1.176599 -0.645804
C  1.21646 0.408951 -0.622485
C  3.34664 -0.555859 0.263661
C  4.770483 -0.234549 0.720945
H  -1.947739 2.279824 0.746902
H  -2.284121 0.890451 1.843534
H  -1.592819 -1.438705 1.032445
H  -0.82498 -1.579026 -0.583515
H  0.266226 1.708484 0.846478
H  0.446045 0.008679 1.378824
H  -4.388843 1.522956 0.688414
H  -3.56813 1.419824 -0.92291
H  -2.915548 -0.840169 -1.704238
H  -3.292638 -2.225478 -0.600795
H  1.107586 -0.617703 -1.010461
H  1.027762 1.115207 -1.45053
H  3.025842 1.471204 -0.114895
H  5.266792 -1.170779 1.014224
H  5.354252 0.23944 -0.089562
H  4.766496 0.452012 1.587781
