program: Gaussian 09
title: 000222366
version: EM64L-G09RevD.01
frameworkgroup: C1[X(C8H16ClNO2)]
method: RPBEPBE
basis: SDD
operation: Freq
keyword: #p
keyword: freq=noraman
keyword: PBEPBE/SDD
title: #p freq=noraman PBEPBE/SDD
converged: YES YES NO NO
title: Mulliken charges:
elementType: Cl O O N C C C C C C C C H H H H H H H H H H H H H H H H
charge: -0.088766 -0.278481 -0.264853 -0.351242 -0.384583 -0.239537 0.058662 -0.386616 -0.688745 -0.691466 0.286294 -0.651343 0.234147 0.219148 0.173161 0.182083 0.173835 0.212198 0.264823 0.213633 0.217471 0.226518 0.198394 0.232003 0.223392 0.318633 0.295578 0.295659
chargesum: 0.00000
title: Mulliken charges with hydrogens summed into heavy atoms:
elementType: Cl O O N C C C C C C C C
charge: -0.088766 -0.278481 -0.264853 -0.032608 0.068712 0.115708 0.232498 0.090404 -0.031123 -0.037678 0.286294 -0.060106
polarizability: 1.30577664e+02 -3.98175936e+00 1.16800733e+02 -8.29632891e+00 5.25903900e+00 8.63946694e+01
1716.lowfreq: -4.1637 -2.7294 -0.0030 -0.0007 0.0007 5.1004 9.3694 14.6501 27.1587
frequency: 8.5740 13.4115 27.1290 67.8176 84.8413 99.7678 120.6393 144.6177 185.8206 188.8551 212.8410 241.2848 303.1174 311.4883 360.0803 389.2244 439.8119 448.8538 508.7438 569.4491 597.8403 650.9525 664.8717 765.6024 799.1552 845.5235 891.3937 906.5612 915.2332 917.9951 935.6118 969.4073 1029.2851 1098.3138 1100.0088 1110.2248 1122.6936 1147.2840 1149.8644 1178.1530 1189.5983 1240.3992 1253.4128 1266.4482 1277.8066 1311.6494 1329.3282 1333.2341 1360.8348 1373.3617 1392.0813 1394.4680 1418.2012 1455.2405 1462.1176 1464.0241 1465.7987 1472.1797 1484.5603 1491.2958 1513.3227 1614.4604 2898.6571 2917.5044 2950.1594 2982.4573 2990.1336 2992.0365 3008.8478 3072.1485 3072.7135 3076.7450 3078.7832 3085.4636 3093.7705 3099.5870 3155.4309 3509.9849
redmass: 4.0879 3.4323 5.7954 4.1761 2.7679 2.9471 2.6453 2.7910 1.2053 2.7881 3.4312 1.2505 2.7591 2.8381 3.6334 4.7369 2.8022 2.6918 2.5160 3.2918 3.8030 1.1317 5.8760 1.6588 2.6481 1.6535 2.7197 1.7267 1.2965 2.3198 1.4037 2.3511 5.5428 3.2079 2.2372 2.4605 2.0327 1.2903 1.6503 1.7507 1.2776 1.6156 1.1934 1.4393 1.1978 1.1682 1.4155 1.3763 1.2966 1.2645 1.2228 1.4408 1.0907 1.0489 1.0728 1.0914 1.0643 1.0501 1.0612 1.0715 1.9493 8.2116 1.0572 1.0835 1.1020 1.0356 1.0657 1.0356 1.0608 1.0970 1.0583 1.0988 1.1013 1.1006 1.0995 1.1001 1.1095 1.0775
irintensity: 0.8146 0.7701 0.2294 7.8830 7.4122 3.3758 1.3499 7.3893 0.7225 7.8971 4.4052 1.9355 2.0439 9.8244 0.3350 15.2526 4.1187 0.7031 0.5878 8.4240 6.2003 125.0631 69.8258 12.9069 9.5493 2.6226 7.1906 9.3428 1.5139 3.9085 0.6724 3.2735 107.1273 40.1680 9.0560 18.4150 44.2068 5.5027 14.3484 20.9973 4.0007 1.4442 19.1430 51.3483 15.9872 17.0005 7.3192 26.5648 1.8119 32.7779 24.9553 0.9785 28.9794 5.1864 12.2750 22.9274 8.9624 7.4076 4.8351 14.9699 214.3206 233.5127 53.6045 76.4329 53.9501 24.0625 40.3213 19.8721 20.6155 27.3691 3.2739 38.4682 15.5710 11.7281 59.9892 33.3133 1.1698 39.7687
temp: 298.150 k
press: 1.00000 atm
elementType: 17 8 8 7 6 6 6 6 6 6 6 6 1 1 1 1 1 1 1 1 1 1 1 1 1 1 1 1
symmnumber: 1
zpe: 616499.0 jmol-1
zpe.correction: 0.234812 hartree
zpe.thermalcorrener: 0.249970 hartree
zpe.thermalcorrenthalpy: 0.250914 hartree
zpe.thermalcorrgfe: 0.187791 hartree
zpe.sumelectzpe: -978.727185 hartree
zpe.sumelectthermal: -978.712027 hartree
zpe.sumelectthermalent: -978.711083 hartree
zpe.sumelectthermalfe: -978.774206 hartree
dipole: -1.9026 1.7774 2.2054
dipole: 3.4122
quadrupole: -81.2711 -88.6705 -79.6886
quadrupole: 1.7058 -1.6813 -5.0457
quadrupole: 1.9389 -5.4604 3.5215 1.7058 -1.6813 -5.0457
hfenergy: -978.9619973 hartree
pointgroup: C01 [X(C8H16Cl1N1O2)]
dipole: 0.8765854 0.243871 -0.9870572 debye
polarizability: 132.3162759|1.5856531|106.8785188|-4.9452626|-15.0342015|94.5782713 unknown
InChI: InChI=1S/C8H16ClNO2/c1-7(2)12-5-3-4-10-8(11)6-9/h7,10H,3-6H2,1-2H3
charge 0 multiplicity 1
28 atoms
Cl -3.08753 1.951578 -1.786249
O  2.422646 -0.252488 0.445887
O  -3.543969 -1.182554 0.788587
N  -1.846985 -0.608669 -0.721324
C  0.295684 -1.38041 0.37325
C  1.271642 -0.504313 -0.423561
C  3.573921 0.396483 -0.226014
C  -0.977812 -1.760279 -0.41483
C  3.266884 1.857996 -0.610824
C  4.734963 0.281638 0.768896
C  -3.047334 -0.411665 -0.092004
C  -3.870623 0.82252 -0.469125
H  0.015856 -0.857337 1.30558
H  0.820676 -2.308876 0.667186
H  1.599417 -1.029146 -1.35225
H  0.789308 0.453701 -0.721175
H  3.810812 -0.184739 -1.147974
H  -0.705932 -2.263964 -1.363665
H  -1.587848 -2.461257 0.180229
H  4.159896 2.330401 -1.060196
H  2.445131 1.929557 -1.34599
H  2.982231 2.434455 0.287779
H  5.660215 0.706957 0.340326
H  4.91588 -0.775533 1.027602
H  4.492911 0.827487 1.698132
H  -1.55372 0.086544 -1.413453
H  -4.841351 0.509963 -0.880205
H  -4.01867 1.45495 0.417985
