program: Gaussian 09
title: 000222365
version: EM64L-G09RevD.01
frameworkgroup: C1[X(C8H14ClNO)]
method: RPBEPBE
basis: SDD
operation: Freq
keyword: #p
keyword: freq=noraman
keyword: PBEPBE/SDD
title: #p freq=noraman PBEPBE/SDD
converged: YES YES NO NO
title: Mulliken charges:
elementType: Cl O N C C C C C C C C H H H H H H H H H H H H H H
charge: -0.091242 -0.271244 -0.381900 -0.042728 -0.447053 -0.418418 -0.413303 -0.401393 -0.378090 0.281277 -0.667057 0.256996 0.218544 0.203219 0.197551 0.238163 0.188777 0.211121 0.205933 0.203601 0.194265 0.204931 0.322203 0.293259 0.292588
chargesum: 0.00000
title: Mulliken charges with hydrogens summed into heavy atoms:
elementType: Cl O N C C C C C C C C
charge: -0.091242 -0.271244 -0.059697 0.214268 -0.025291 0.017295 -0.013406 0.008142 0.021107 0.281277 -0.081210
polarizability: 1.13767097e+02 -2.97583095e+00 1.09182618e+02 2.38726542e+00 -6.43530831e-01 8.08247303e+01
1716.lowfreq: -13.8450 -11.9864 -0.0010 0.0012 0.0013 2.6532 20.3075 52.4572 74.6519
frequency: 19.5451 52.4354 74.6128 99.9901 156.6848 206.6180 223.5052 282.2875 360.0161 375.7059 396.9931 458.6828 470.8602 563.1126 574.1119 630.6584 640.3249 677.2247 775.9066 798.7178 833.9439 861.8584 865.1712 907.2072 918.1568 938.4548 1002.6052 1016.0552 1046.8316 1055.6416 1089.6639 1115.8488 1146.3728 1149.3518 1157.9575 1231.2917 1246.9290 1252.4621 1259.4370 1272.7169 1304.4869 1329.3189 1332.3476 1336.5259 1350.7960 1356.2978 1369.8257 1419.2357 1457.4770 1463.2197 1468.7692 1473.7775 1478.6117 1501.2254 1605.5264 2957.0768 2967.8209 2972.0963 2980.3228 2984.6826 3024.3295 3030.7451 3033.0757 3040.1234 3046.1425 3055.1258 3070.9313 3153.4917 3504.6994
redmass: 4.7304 4.8446 4.3748 2.7129 4.0448 2.3664 5.5186 2.3533 2.8922 2.5969 3.1637 3.0412 1.9872 3.1089 3.7115 1.4650 1.8892 4.7765 1.4992 3.6208 1.6284 2.3576 2.4351 1.7232 1.7234 2.0639 2.8327 2.6002 1.4525 1.8104 1.7234 1.0497 1.3372 1.6952 1.8240 1.5855 1.4059 1.1917 1.2818 1.2979 1.7086 1.3849 1.4894 1.4232 1.4280 1.4787 1.3393 1.0944 1.0845 1.0948 1.1053 1.0917 1.2105 1.6859 9.2396 1.0673 1.0633 1.0630 1.0634 1.0621 1.0858 1.0948 1.0955 1.1005 1.1018 1.1004 1.0566 1.1094 1.0772
irintensity: 0.6420 3.0045 4.5114 10.6153 3.3069 2.3755 10.1876 3.4465 0.6899 1.2445 10.3426 2.3722 0.3419 7.3147 9.8017 37.2950 49.2533 69.3505 0.4807 0.7322 3.1245 7.1817 5.9286 8.1883 9.1697 7.2176 0.2635 4.8890 0.8679 0.2533 0.3611 1.3203 2.6724 5.9569 5.8321 0.3789 8.7878 20.3088 3.5506 11.1302 2.5453 1.0969 2.8974 0.7348 0.9906 2.0258 4.3988 36.0530 12.8359 6.5794 19.0232 11.2644 72.7230 224.2889 232.2879 26.4774 35.8136 29.8405 20.6638 26.4294 34.7823 74.5608 44.1968 28.6209 55.6213 59.2008 4.6271 1.2870 36.5896
temp: 298.150 k
press: 1.00000 atm
elementType: 17 8 7 6 6 6 6 6 6 6 6 1 1 1 1 1 1 1 1 1 1 1 1 1 1
symmnumber: 1
zpe: 557902.7 jmol-1
zpe.correction: 0.212494 hartree
zpe.thermalcorrener: 0.223913 hartree
zpe.thermalcorrenthalpy: 0.224857 hartree
zpe.thermalcorrgfe: 0.173186 hartree
zpe.sumelectzpe: -902.430647 hartree
zpe.sumelectthermal: -902.419228 hartree
zpe.sumelectthermalent: -902.418283 hartree
zpe.sumelectthermalfe: -902.469955 hartree
dipole: 2.0626 -1.7010 0.2982
dipole: 2.6901
quadrupole: -70.4134 -84.8175 -72.6266
quadrupole: 0.7790 1.0319 -0.6822
quadrupole: 5.5391 -8.8650 3.3259 0.7790 1.0319 -0.6822
hfenergy: -902.6431406 hartree
pointgroup: C01 [X(C8H14Cl1N1O1)]
dipole: -0.9670916 0.1472821 0.4039565 debye
dipolederiv: -0.2539429 0.0240951 0.0596605 -0.0555294 -0.2358462 -0.1875236 -0.1362997 -0.1812735 -0.6504026 -0.8108683 -0.0166384 -0.0934705 0.1420471 -0.431332 -0.1881342 0.3907628 -0.1987855 -0.8500426 -1.3215251 0.0411499 0.0230755 -0.0205865 -0.4162081 0.0577808 0.1018394 0.0419615 -0.4716127 0.5533984 -0.0026342 0.1414057 0.1533642 0.2348621 -0.05853 0.3012575 -0.0433602 0.2569357 0.047157 0.027842 0.0041428 -0.0065374 0.0818172 0.0154789 -0.0127272 0.0286994 0.0577119 0.0002281 0.0081344 0.0616652 -0.0362758 0.0237355 0.0691417 -0.0058508 0.0302873 0.0609867 0.112983 0.0168774 0.0396731 0.0306169 0.0379113 0.0186398 0.0665376 0.0205124 0.0820765 0.0978443 0.031936 0.028529 0.0118274 0.0575757 -0.0089346 0.0284021 0.0191143 0.0623934 0.101438 0.0084477 0.0358345 0.0184697 0.0716361 0.0475127 0.0534757 0.0324625 0.0896582 1.5868623 0.0192654 0.1084186 -0.1592413 0.2463031 0.2135491 -0.5684062 0.2319048 0.7543759 -0.0431088 -0.1127812 -0.2746678 -0.0056271 0.2331096 0.1983556 -0.0132675 0.1980129 0.6975941 -0.004727 0.0861671 0.0448642 0.0245303 -0.045515 -0.0442142 -0.0267681 -0.0685447 0.0088488 0.0513121 0.0877897 -0.0309512 0.0723002 -0.0955407 0.09835 -0.0088519 0.1340653 -0.0364367 -0.0961288 -0.0790675 -0.0746871 -0.0411772 0.0469138 -0.0583347 -0.078358 -0.1009143 -0.0266996 -0.0667046 -0.0463082 -0.1486755 -0.0081735 -0.0029783 -0.0772667 -0.1263728 -0.057388 -0.0254684 -0.0525083 -0.0440551 0.1324408 -0.0393116 0.0209709 0.0313958 0.1027889 0.0317912 0.0081506 -0.0574724 -0.0338884 -0.1574691 -0.0478798 -0.0065949 -0.0715715 -0.1317593 -0.0476412 -0.0465186 -0.1164268 -0.0576327 0.1378896 -0.0602221 0.0179508 0.0720508 0.1110959 0.0555417 -0.0204051 0.0265752 0.0722334 -0.0314348 0.070021 -0.0983888 0.1263585 -0.0277495 0.1435835 -0.041023 -0.0634631 -0.094214 -0.0617322 -0.0754215 0.0384914 -0.0575873 -0.0793849 -0.1017798 -0.0381929 -0.0739516 -0.0529661 -0.0833903 -0.1080268 0.0245837 -0.0381475 -0.1390006 -0.0160251 -0.046276 -0.0042042 0.0873539 0.0603867 0.124947 -0.1059031 -0.0831362 0.0967711 -0.0962857 -0.01066 0.2780965 0.0159755 0.0649164 -0.0043694 0.2636642 -0.0471417 0.0537861 -0.0350874 0.2065533 0.0442247 0.0592196 -0.0144703 0.0932427 0.0179131 -0.0025743 -0.0085146 -0.0356067 -0.0024592 0.064912 -0.0463011 0.0280463 -0.0729871 0.0208687 -0.0255172 0.0565939 0.0147553 -0.0190876 unknown
polarizability: 114.9856783|-2.6496812|83.422153|-0.5909823|8.0170328|105.3666142 unknown
InChI: InChI=1S/C8H14ClNO/c9-6-8(11)10-7-4-2-1-3-5-7/h7,10H,1-6H2
charge 0 multiplicity 1
25 atoms
Cl 2.300839 0.554759 2.597408
O  2.121183 -0.910015 -1.209001
N  0.46993 -0.437671 0.378778
C  -0.67422 -0.830218 -0.479986
C  -1.854075 -1.305132 0.402439
C  -1.109347 0.335997 -1.410028
C  -2.521553 -0.14338 1.182202
C  -1.765099 1.496796 -0.626052
C  -2.954533 0.997925 0.230521
C  1.762352 -0.506159 -0.055846
C  2.880681 -0.087209 0.901714
H  -0.311861 -1.663972 -1.110001
H  -1.511212 -2.097637 1.095231
H  -2.608705 -1.76509 -0.265664
H  -1.834867 -0.069443 -2.144601
H  -0.231834 0.686451 -1.983461
H  -1.823666 0.262879 1.945418
H  -3.393784 -0.528943 1.743565
H  -2.103148 2.279836 -1.331248
H  -1.009364 1.971518 0.033123
H  -3.755995 0.625473 -0.440865
H  -3.386799 1.835268 0.81131
H  0.29684 -0.086661 1.325283
H  3.53168 -0.947905 1.113873
H  3.464857 0.730538 0.455789
