program: Gaussian 09
title: 000222364
version: EM64L-G09RevD.01
frameworkgroup: C1[X(C8H7ClN2O3)]
method: RPBEPBE
basis: SDD
operation: Freq
keyword: #p
keyword: freq=noraman
keyword: PBEPBE/SDD
title: #p freq=noraman PBEPBE/SDD
converged: NO YES NO NO
title: Mulliken charges:
elementType: Cl O O O N N C C C C C C C C H H H H H H H
charge: -0.039486 -0.237755 -0.205032 -0.209592 -0.433415 0.019951 0.646792 -0.349883 -0.291941 0.418976 -0.387399 -0.383095 0.228921 -0.792114 0.323828 0.312428 0.291893 0.323013 0.245082 0.273724 0.245104
chargesum: 0.00000
title: Mulliken charges with hydrogens summed into heavy atoms:
elementType: Cl O O O N N C C C C C C C C
charge: -0.039486 -0.237755 -0.205032 -0.209592 -0.110402 0.019951 0.646792 -0.349883 0.031886 0.418976 -0.074972 -0.091202 0.228921 -0.028204
polarizability: 2.16236229e+02 3.32586952e+00 1.40167889e+02 -4.61244954e-03 2.98914481e-03 5.07139065e+01
1716.lowfreq: -54.5892 -5.2938 -0.0017 -0.0015 0.0005 3.5554 4.8867 54.7132 65.6862
frequency: -54.5706 54.6912 65.6796 73.1772 122.8357 148.5208 170.8943 171.5724 246.9305 278.8067 331.9711 332.1269 429.3988 431.6691 446.2701 519.4950 531.1696 583.0298 583.8928 655.0064 687.0866 698.2021 708.4242 746.0862 786.3910 847.9736 870.7464 917.1153 933.3738 985.2204 1008.1745 1024.8640 1035.3485 1096.6516 1137.0608 1201.2344 1223.6083 1243.2410 1296.8141 1351.3504 1378.8921 1380.9769 1422.0052 1442.3633 1465.5797 1465.9035 1514.0601 1582.9954 1604.4523 1645.4503 2991.6269 3076.6242 3141.8936 3182.7680 3189.7882 3199.5639 3474.2760
redmass: 1.0402 6.4668 6.5172 8.6086 6.3380 5.0965 5.4011 13.6389 10.9941 5.0596 6.1174 11.3984 8.1417 5.0439 3.5005 6.5256 4.1947 5.2469 3.0017 6.5714 4.4462 9.6625 1.5275 2.8839 6.4720 6.2226 1.3958 1.4267 6.4086 1.7275 1.3269 2.6877 1.6760 2.9916 1.2984 5.5154 3.4630 1.6697 2.0570 5.6701 3.8808 1.4556 6.1051 1.3004 1.9259 1.0460 2.3867 6.3506 7.1809 5.0684 1.0386 1.0982 1.0982 1.0902 1.0931 1.0965 1.0764
irintensity: 0.4291 0.4483 1.7664 9.5309 3.3849 1.2240 0.0154 3.5441 1.0434 1.1978 2.9852 2.1279 2.7001 9.6785 9.5390 1.5586 3.8682 5.8423 0.0260 11.1415 37.6756 42.7741 21.4474 36.3877 11.2256 9.7464 37.1993 36.5453 1.6217 53.6867 0.6833 15.6570 9.4395 48.4904 32.7172 668.6165 5.8269 77.4513 76.9127 73.7271 233.9873 138.9010 56.4068 43.2288 8.5132 21.4906 415.2066 17.2287 201.3056 98.3296 3.7208 10.4034 5.9626 4.8495 10.7280 6.4448 46.8537
temp: 298.150 k
press: 1.00000 atm
elementType: 17 8 8 8 7 7 6 6 6 6 6 6 6 6 1 1 1 1 1 1 1
symmnumber: 1
zpe: 377633.1 jmol-1
zpe.correction: 0.143833 hartree
zpe.thermalcorrener: 0.156096 hartree
zpe.thermalcorrenthalpy: 0.157040 hartree
zpe.thermalcorrgfe: 0.103966 hartree
zpe.sumelectzpe: -1103.211362 hartree
zpe.sumelectthermal: -1103.199099 hartree
zpe.sumelectthermalent: -1103.198155 hartree
zpe.sumelectthermalfe: -1103.251229 hartree
dipole: 6.2319 2.3967 -0.0021
dipole: 6.6768
quadrupole: -98.2303 -93.4407 -87.6200
quadrupole: 6.1233 0.0158 0.0015
quadrupole: -5.1333 -0.3437 5.4770 6.1233 0.0158 0.0015
hfenergy: -1103.355195 hartree
pointgroup: C01 [X(C8H7Cl1N2O3)]
dipole: -2.4098652 1.0454692 0.0029905 debye
dipolederiv: -0.2262515 0.2152197 0.0004868 0.2255297 -0.6330018 -0.0013951 0.000542 -0.0013392 -0.0434128 -0.6680734 0.06174 0.0000368 -0.5772033 -0.9319095 -0.0015392 -0.0015065 -0.0013836 -0.3258423 -0.7721004 0.2253485 0.0004824 0.3814412 -0.721659 -0.0008161 0.0015022 -0.0018289 -0.2267274 -0.8977685 -0.1702757 -0.0006019 -0.3427046 -0.6118419 -0.0013426 -0.000169 -0.0005097 -0.2317294 -2.34677 -0.3423027 -0.0013061 -0.5189595 -0.5174656 -0.0006815 -0.0019471 -0.0006362 -0.2976236 2.2332315 -0.1270255 -0.0002307 -0.1203683 1.0676815 0.0021944 -0.0008342 0.0022555 0.1885089 1.574387 0.1737266 0.0007579 -0.2705437 -0.1253565 -0.0007087 -0.0001987 -0.0005611 0.1368641 -0.3487208 -0.4128675 -0.0010216 -0.6426368 0.9435787 0.0024232 -0.0016287 0.0023572 -0.1050331 -0.4697937 -0.0101551 -0.0000749 0.4339568 -0.061995 0.0002995 0.0009003 0.0001926 -0.1404733 -1.0799829 0.0949707 0.0002731 0.0910185 0.012317 -0.0000971 -0.0000409 -0.0000047 0.040785 0.2593516 0.0703753 0.0002321 -0.2079774 -0.1799085 -0.0003179 -0.0007145 -0.0002905 -0.0455564 0.4081191 -0.0438306 0.0000076 0.1814194 0.0089929 0.0002521 0.0002695 0.0003186 -0.1028494 2.0445885 0.2107478 0.0010545 1.1289801 1.2768991 0.0028018 0.0033986 0.0026052 0.1876716 -0.4656427 0.1067587 0.0000755 0.2537574 -0.0970667 -0.0002097 0.0003101 -0.0002443 0.0432223 0.1530154 -0.0179972 -0.0000364 0.0024708 0.0831526 -0.0002454 0.0001051 -0.0002674 0.1796347 0.1330266 -0.0470672 -0.0001393 0.0002153 0.100373 -0.0001942 0.0000071 -0.0001905 0.1783814 0.1081234 0.0451842 0.0000818 0.0128236 0.0631738 -0.0002443 0.0000277 -0.0002668 0.1710035 0.2166632 0.0205693 0.0000274 0.042075 0.211943 -0.0001615 0.0000683 -0.000183 0.2926893 0.0668497 -0.0026552 -0.0270374 0.0209169 0.0477525 -0.1016936 0.0167128 -0.1000444 -0.017923 0.0109078 -0.0476496 -0.0001259 -0.1151392 0.0174117 -0.0002745 -0.000246 -0.0002686 0.1354755 0.06684 -0.0028146 0.0270583 0.0209282 0.0469287 0.1019503 -0.0165583 0.1002896 -0.0170655 unknown
polarizability: 215.8208407|-6.5182044|140.5827449|0.0075802|0.2180978|50.7144388 unknown
InChI: InChI=1S/C8H7ClN2O3/c1-5(12)10-8-3-2-6(11(13)14)4-7(8)9/h2-4,10H,1H3
charge 0 multiplicity 1
21 atoms
Cl -0.720642 2.967261 0.007256
O  -3.162538 -1.789584 -0.004854
O  3.831286 -1.554881 -0.003971
O  4.098801 0.714842 0.001693
N  -2.296941 0.397086 0.000562
N  3.364303 -0.349879 0.000424
C  -0.910984 0.159379 0.00042
C  -0.019499 1.275786 0.003381
C  -0.336353 -1.146132 -0.002564
C  1.895439 -0.178376 0.000419
C  1.368982 1.1324 0.003425
C  1.057864 -1.31411 -0.002569
C  -3.348558 -0.542183 -0.002004
C  -4.73145 0.100684 -0.001024
H  -1.00978 -2.0045 -0.004842
H  2.042783 1.99215 0.005701
H  1.505338 -2.310968 -0.004846
H  -2.566618 1.387252 0.002798
H  -4.878089 0.731735 0.894911
H  -5.489649 -0.694594 -0.002886
H  -4.877596 0.735432 -0.894428
