program: Gaussian 09
title: 000222363
version: EM64L-G09RevD.01
frameworkgroup: C1[X(C8H6Cl3NO)]
method: RPBEPBE
basis: SDD
operation: Freq
keyword: #p
keyword: freq=noraman
keyword: PBEPBE/SDD
title: #p freq=noraman PBEPBE/SDD
converged: NO YES NO NO
title: Mulliken charges:
elementType: Cl Cl Cl O N C C C C C C C C H H H H H H
charge: -0.038785 -0.041050 -0.060338 -0.242240 -0.437827 0.651186 -0.407612 -0.262906 -0.111214 -0.191136 -0.249711 0.261025 -0.672190 0.336987 0.336177 0.262141 0.265375 0.301047 0.301073
chargesum: 0.00000
title: Mulliken charges with hydrogens summed into heavy atoms:
elementType: Cl Cl Cl O N C C C C C C C C
charge: -0.038785 -0.041050 -0.060338 -0.242240 -0.101650 0.651186 -0.407612 0.074081 -0.111214 0.071005 0.015664 0.261025 -0.070070
polarizability: 1.83074250e+02 -9.18629753e+00 1.48370725e+02 1.94624641e-02 3.95451163e-02 4.97537558e+01
1716.lowfreq: -3.8148 0.0021 0.0022 0.0027 1.8161 5.0137 31.6280 77.8495 84.3941
frequency: 31.4959 77.8456 84.3909 85.7976 97.4399 142.5250 201.1454 234.9610 278.4415 308.0969 310.3652 374.7742 407.2071 446.3450 484.1088 516.8779 544.3432 595.1545 640.0762 693.3549 709.8260 721.6515 779.9542 800.8767 894.1693 906.4353 920.4153 938.1824 946.7001 1015.6175 1082.1478 1135.3717 1154.7803 1215.5616 1242.4300 1260.9576 1275.4054 1372.8671 1406.4663 1419.7543 1446.5134 1521.7075 1577.0114 1600.5751 1610.5508 3070.3072 3151.2453 3167.5570 3186.6403 3191.2618 3409.7814
redmass: 12.0194 3.6782 17.9898 4.2611 9.5570 23.2060 15.9172 5.2390 9.5756 5.8310 27.8513 13.9959 6.3891 3.2142 6.3713 9.2876 3.4704 4.1484 6.6131 6.4728 3.3999 7.3445 1.2506 1.3200 6.6321 1.7356 1.3891 1.3465 6.3352 6.8822 1.8782 1.4175 1.1115 3.5909 1.5895 1.2085 1.6337 8.7397 3.3310 1.1486 2.6338 2.7005 4.1314 8.4054 6.1910 1.0566 1.1091 1.0891 1.0977 1.0936 1.0766
irintensity: 0.0972 14.7638 0.1219 2.1776 0.8945 2.5578 3.8276 0.5416 9.7973 1.3638 0.3168 1.2950 17.5834 16.3545 16.9404 24.5387 0.7621 2.7652 1.6658 89.6499 4.7838 0.5192 47.8565 59.4012 39.2554 15.0772 30.1922 4.9009 11.2674 63.1395 23.2655 1.6655 0.4540 33.9787 6.9890 19.7899 10.2339 44.2127 91.9307 12.3157 53.2043 492.9855 57.6902 245.2507 64.9160 2.7664 0.4283 0.3459 0.0360 19.0580 89.8791
temp: 298.150 k
press: 1.00000 atm
elementType: 17 17 17 8 7 6 6 6 6 6 6 6 6 1 1 1 1 1 1
symmnumber: 1
zpe: 327103.7 jmol-1
zpe.correction: 0.124587 hartree
zpe.thermalcorrener: 0.137117 hartree
zpe.thermalcorrenthalpy: 0.138061 hartree
zpe.thermalcorrgfe: 0.083378 hartree
zpe.sumelectzpe: -1817.684940 hartree
zpe.sumelectthermal: -1817.672410 hartree
zpe.sumelectthermalent: -1817.671466 hartree
zpe.sumelectthermalfe: -1817.726149 hartree
dipole: -0.6904 1.6991 0.0100
dipole: 1.8341
quadrupole: -94.5418 -97.7929 -97.2504
quadrupole: 11.8952 0.0111 -0.0427
quadrupole: 1.9866 -1.2645 -0.7220 11.8952 0.0111 -0.0427
hfenergy: -1817.8095269 hartree
pointgroup: C01 [X(C8H6Cl3N1O1)]
dipole: -0.0342075 0.6961195 0.1868502 debye
dipolederiv: -0.2182933 -0.2216383 -0.0416815 -0.1760709 -0.6106369 -0.1369901 -0.0293279 -0.1323308 -0.0707064 -0.2723709 -0.2546712 -0.0474262 -0.3348542 -0.6496786 -0.1261835 -0.0693672 -0.1344799 -0.0883134 -0.3840919 -0.1003797 -0.0025457 -0.3209936 -0.5082305 -0.0634338 -0.0610438 -0.0858006 -0.1636711 -0.7317836 -0.2152474 -0.0175411 0.4733754 -0.8983246 -0.1935315 0.1657647 -0.1253767 -0.3941834 -1.7549633 0.2036533 0.2035512 0.414639 -0.5547817 -0.1168792 0.2609102 -0.0958675 -0.3239503 1.1445033 -0.120705 -0.1334664 0.181105 -0.0702644 -0.0735502 -0.0527901 -0.0430211 0.1307336 -0.0461865 0.3472194 0.0853237 0.3611693 0.8266503 0.2215519 0.0887032 0.2227891 -0.077576 -0.374223 -0.0587037 0.0102962 -0.2668818 -0.2768506 -0.0176639 -0.0458417 -0.0388491 -0.1178927 0.4320336 0.3796345 0.0528712 0.5638412 1.0298845 0.2394127 0.1031466 0.2579158 -0.0046826 0.0622059 0.0025358 -0.0125137 -0.0957231 -0.0880307 0.0047785 -0.0393212 -0.0049936 -0.0676336 -0.1428687 -0.068616 -0.0171175 -0.1060058 -0.3096522 -0.0384648 -0.0271114 -0.042338 -0.1372785 1.5510908 0.0393646 -0.1266464 -1.0730872 1.0057422 0.3201013 -0.4253185 0.2091223 0.2993324 -0.0191397 0.0388759 0.0270808 0.3694718 0.6683875 0.1025267 0.116094 0.1366793 0.1664254 0.205663 0.0334835 0.007375 0.0008617 0.103827 -0.0231672 -0.0011143 -0.0261492 0.1816343 0.3874419 0.0336774 -0.0019187 0.0263644 0.2492445 -0.0122605 -0.003406 -0.0131832 0.2823387 0.0636114 0.0362306 0.0200416 0.0530067 0.0113819 -0.0469926 0.0246283 -0.0451973 0.1509631 -0.020916 -0.0224342 0.0136318 -0.0290958 0.0918319 -0.019637 0.0118249 -0.0202208 0.1686603 0.0703044 -0.0384399 0.0252984 -0.0444013 0.0078228 -0.049329 0.0620839 -0.0300083 0.0035476 0.0479825 -0.0138397 -0.0446128 0.0032792 -0.0283224 0.0297123 -0.0785136 0.0113096 0.0622525 unknown
polarizability: 168.8394824|21.4294312|154.9487816|-6.2112954|26.1420184|57.4104661 unknown
InChI: InChI=1S/C8H6Cl3NO/c9-4-8(13)12-7-3-5(10)1-2-6(7)11/h1-3,12H,4H2
charge 0 multiplicity 1
19 atoms
Cl -0.371812 3.016444 0.731973
Cl -2.977563 -2.709729 -0.553262
Cl 3.822615 1.939807 0.010244
O  1.943862 -1.596058 -0.736865
N  1.147101 0.530753 -0.091326
C  -0.248509 0.305838 -0.011732
C  -1.101819 1.380875 0.364139
C  -0.843093 -0.955017 -0.292739
C  -2.237423 -1.088605 -0.188681
C  -2.493175 1.22803 0.462814
C  -3.082517 -0.025517 0.183399
C  2.127777 -0.378955 -0.432028
C  3.575858 0.119112 -0.449225
H  -0.204948 -1.790993 -0.583824
H  1.468618 1.483995 0.130908
H  -3.115631 2.077977 0.75493
H  -4.164378 -0.161766 0.254995
H  3.989815 0.00026 -1.461286
H  4.169517 -0.462153 0.271166
