program: Gaussian 09
title: 000222340
version: EM64L-G09RevD.01
frameworkgroup: C1[X(C12H13ClO3)]
method: RPBEPBE
basis: SDD
operation: Freq
keyword: #p
keyword: freq=noraman
keyword: PBEPBE/SDD
title: #p freq=noraman PBEPBE/SDD
converged: YES YES NO NO
title: Mulliken charges:
elementType: Cl O O O C C C C C C C C C C C C H H H H H H H H H H H H H
charge: -0.026399 -0.276035 -0.287318 -0.189610 0.539146 -0.615665 -0.495657 0.189180 -0.477527 0.258298 -0.294063 -0.027692 -0.507210 0.315651 -0.586793 -0.685151 0.216604 0.229009 0.273380 0.236995 0.261962 0.231634 0.244060 0.222564 0.232372 0.216953 0.219803 0.289542 0.291967
chargesum: 0.00000
title: Mulliken charges with hydrogens summed into heavy atoms:
elementType: Cl O O O C C C C C C C C C C C C
charge: -0.026399 -0.276035 -0.287318 -0.189610 0.539146 -0.170052 -0.222276 0.189180 -0.240532 0.258298 -0.032101 0.203941 0.191786 0.315651 -0.150037 -0.103642
polarizability: 2.20485707e+02 3.21950568e+00 1.56001112e+02 -6.72980844e+00 -3.14687360e+00 8.85675987e+01
1716.lowfreq: -10.8032 -4.3274 -3.1425 -0.0034 -0.0024 -0.0023 12.8425 16.5253 38.0679
frequency: 11.8718 15.4495 37.9087 43.9368 56.2014 69.7515 88.0860 135.9507 152.1572 175.0098 196.6429 217.5500 240.4859 288.5428 300.3516 359.6750 373.2067 385.0293 444.9942 460.7415 484.0615 539.9341 568.3168 598.8713 618.1604 669.9410 699.3406 723.5021 735.5372 750.8893 806.8657 859.5760 887.7053 897.8833 919.2911 924.9373 937.3680 941.2211 950.2962 1008.8121 1015.6508 1089.7469 1092.6373 1103.9660 1116.3967 1151.3626 1163.5984 1175.6645 1209.7238 1212.3067 1251.0148 1258.5972 1263.3824 1287.9532 1306.3539 1380.0815 1401.6511 1424.7675 1431.6074 1442.8227 1453.2676 1460.4351 1465.6041 1484.1499 1580.7493 1613.1442 1647.4029 1656.5562 2967.4550 2992.3843 3017.3559 3083.7701 3086.5503 3097.1879 3103.1605 3127.6325 3137.6611 3155.7241 3182.5693 3184.3681 3196.5253
redmass: 7.0369 4.1565 3.9734 5.2069 3.6900 4.0660 3.9410 3.4876 4.0114 2.5557 1.8132 4.0405 2.9464 3.9872 4.9499 3.1299 3.3930 3.4496 4.4186 3.2073 2.8817 4.7042 6.5352 3.9302 2.3033 5.5581 4.3546 5.4980 3.2585 5.7082 1.4886 2.6120 2.3522 3.5303 1.5097 1.8037 2.0577 1.3684 1.4438 2.7719 1.2846 2.6784 1.7342 1.3141 1.7763 1.4295 1.9378 1.5757 2.0526 1.3084 2.5509 1.3137 1.1952 1.2686 1.8741 8.6368 2.1866 1.1926 1.1059 1.3184 1.1620 1.0588 1.0553 2.7965 7.7541 6.6387 11.2067 4.7117 1.0592 1.0312 1.0997 1.0632 1.0562 1.0907 1.1016 1.1053 1.0903 1.0915 1.1122 1.0948 1.1143
irintensity: 1.6494 0.6815 3.4989 2.9343 1.5558 4.9834 1.2504 1.1437 1.7992 2.5820 0.7698 0.8824 0.6402 3.8123 4.4316 1.2944 1.0140 0.8711 7.5737 6.0466 6.2336 18.1546 3.4803 14.3347 3.6027 19.6720 11.5498 4.0366 21.9146 2.2019 39.3009 25.1667 13.0791 67.3241 17.8739 4.2640 14.6430 1.4338 64.8709 78.9560 2.8839 37.2392 221.8973 8.3484 3.2138 12.1773 6.1293 77.9150 147.6764 9.3608 91.8391 2.8638 6.4179 6.6179 33.0149 7.3296 50.5149 7.6783 17.1758 3.3941 31.6749 14.1616 34.1675 89.0966 39.8212 46.5440 216.3552 15.9601 25.0543 49.4707 13.4884 16.4568 6.6572 8.2253 35.5691 23.5916 10.9085 0.7154 1.4556 2.0763 27.3968
temp: 298.150 k
press: 1.00000 atm
elementType: 17 8 8 8 6 6 6 6 6 6 6 6 6 6 6 6 1 1 1 1 1 1 1 1 1 1 1 1 1
symmnumber: 1
zpe: 580481.9 jmol-1
zpe.correction: 0.221094 hartree
zpe.thermalcorrener: 0.238068 hartree
zpe.thermalcorrenthalpy: 0.239012 hartree
zpe.thermalcorrgfe: 0.171920 hartree
zpe.sumelectzpe: -1149.572923 hartree
zpe.sumelectthermal: -1149.555949 hartree
zpe.sumelectthermalent: -1149.555005 hartree
zpe.sumelectthermalfe: -1149.622097 hartree
dipole: 0.0481 -0.4699 1.3824
dipole: 1.4608
quadrupole: -93.9241 -98.9243 -101.5585
quadrupole: -0.9225 -8.2522 -5.7796
quadrupole: 4.2115 -0.7886 -3.4229 -0.9225 -8.2522 -5.7796
hfenergy: -1149.7940165 hartree
pointgroup: C01 [X(C12H13Cl1O3)]
dipole: -0.0316988 -0.1848642 -0.5432747 debye
polarizability: 218.7131961|5.2034797|156.2278684|-15.8143933|2.0325227|90.1133536 unknown
InChI: InChI=1S/C12H13ClO3/c1-3-4-9-5-6-10(11(7-9)15-2)16-12(14)8-13/h3,5-7H,1,4,8H2,2H3
charge 0 multiplicity 1
29 atoms
Cl 4.688506 1.662099 -0.143483
O  -0.214897 2.299048 -0.304597
O  1.78397 0.200367 -0.845782
O  2.894397 -1.425368 0.453771
C  -2.26983 -0.735109 0.123481
C  -3.728558 -1.057379 0.454109
C  -1.826866 0.601503 0.041773
C  -0.47372 0.929108 -0.224238
C  -1.325856 -1.777026 -0.069608
C  0.449304 -0.13628 -0.424473
C  0.02235 -1.479354 -0.34225
C  -4.734747 -0.133344 -0.206094
C  1.129983 2.837357 -0.022403
C  2.909799 -0.487911 -0.367051
C  -5.681822 0.580828 0.451972
C  4.157318 0.075742 -1.022344
H  -3.933458 -2.102809 0.146129
H  -3.875313 -1.022372 1.552363
H  -2.524749 1.432464 0.186667
H  -1.645318 -2.823421 -0.011777
H  0.743678 -2.28489 -0.496905
H  -4.66969 -0.063226 -1.302661
H  1.81282 2.676226 -0.870552
H  1.558913 2.383233 0.889003
H  0.964449 3.913964 0.137355
H  -6.393645 1.220069 -0.0820
H  -5.771928 0.545573 1.54523
H  3.982321 0.355554 -2.06946
H  4.994388 -0.623248 -0.905274
