program: Gaussian 09
title: 000002638
version: EM64L-G09RevD.01
frameworkgroup: C1[X(C16H17N3O7S2)]
method: RPBEPBE
basis: SDD
operation: Freq
keyword: #p
keyword: freq=noraman
keyword: PBEPBE/SDD
title: #p freq=noraman PBEPBE/SDD
converged: YES YES NO NO
title: Mulliken charges:
elementType: S S O O O O O O O N N N C C C C C C C C C C C C C C C C H H H H H H H H H H H H H H H H H
charge: 0.297556 0.256729 -0.232112 -0.177745 -0.294249 -0.403599 -0.240566 -0.243933 -0.280519 -0.154267 -0.417027 -0.613943 0.225329 -0.536569 0.095122 0.149438 0.405489 -0.847979 -0.479662 0.221445 0.122781 -0.535663 -0.585285 -0.110192 -0.278043 0.306915 -0.122228 -0.503112 0.360405 0.370269 0.307365 0.288254 0.272416 0.287773 0.243176 0.253692 0.212347 0.263927 0.261077 0.389800 0.261427 0.249930 0.267681 0.344966 0.341386
chargesum: 0.00000
title: Mulliken charges with hydrogens summed into heavy atoms:
elementType: S S O O O O O O O N N N C C C C C C C C C C C C C C C C
charge: 0.297556 0.256729 -0.232112 -0.177745 -0.294249 -0.013799 -0.240566 -0.243933 -0.280519 -0.154267 -0.046758 0.072410 0.225329 -0.176165 0.095122 0.149438 0.405489 -0.252361 0.080526 0.221445 0.122781 0.173552 -0.060282 -0.110192 -0.016616 0.306915 0.127702 -0.235431
polarizability: 3.18671419e+02 2.46391146e+01 2.39800169e+02 4.36643994e+01 7.69720864e+00 2.00555340e+02
1716.lowfreq: -6.1458 -5.6736 -0.0025 -0.0021 -0.0016 4.6677 10.0206 19.1708 22.7793
frequency: 9.5927 19.0834 22.7527 32.7449 37.1591 45.2451 52.5678 61.7640 65.1454 70.7618 84.3120 92.4678 103.4922 114.5441 122.4542 144.0630 158.9842 174.0414 185.4150 196.3837 219.0954 223.0972 249.5838 276.7847 281.9334 302.2577 312.7761 328.8774 341.4978 360.3095 373.1235 435.1420 436.2032 457.5896 475.0632 496.9349 513.4995 521.8421 526.6406 551.0604 556.6158 571.8898 583.1457 599.1368 608.5485 613.5548 638.1858 647.6729 663.8883 666.6428 687.7962 699.8451 701.8827 709.6810 721.3549 731.6185 758.8683 766.4071 795.2096 821.3213 828.6123 842.5817 860.0048 886.2096 908.9721 919.7011 937.2076 960.9718 969.9863 991.9814 1020.1442 1039.4514 1040.7721 1051.6044 1061.0458 1065.3164 1080.7909 1111.9739 1118.9309 1126.8315 1134.8936 1160.5447 1170.9303 1190.1069 1199.6761 1207.0438 1238.3218 1242.1307 1249.1200 1268.3178 1284.0713 1289.6635 1291.2488 1311.7025 1342.3564 1363.1356 1384.9226 1426.3504 1427.4978 1433.9456 1456.7291 1462.7984 1462.8922 1477.1546 1478.4258 1550.6974 1588.5109 1610.2220 1622.4953 1630.0249 1686.9761 1713.7627 2968.2341 3004.2837 3006.5988 3007.3820 3063.4238 3067.7567 3072.0947 3107.9999 3127.9514 3136.1312 3162.4744 3186.3071 3239.9562 3484.2113 3531.6704 3556.4381 3713.5979
redmass: 6.7891 7.1490 8.0440 6.2291 6.1260 9.7118 6.8632 5.2945 4.5063 5.1926 6.0035 5.9232 5.0902 4.2714 5.3374 1.7525 7.7822 4.4574 4.5358 3.5328 5.6908 8.3964 7.1400 4.0949 3.1852 5.5928 3.7562 5.0380 4.7917 7.0906 7.1470 5.4219 4.4737 5.6841 4.3408 3.4079 1.1627 3.4824 1.1194 3.7113 2.4027 4.1306 4.3984 6.1913 2.5531 4.9978 1.3821 5.5451 4.8362 3.7685 4.5980 10.2921 1.2528 5.8715 5.3852 8.5251 5.6923 6.8859 4.5501 3.9682 2.4247 1.8353 1.9952 5.1325 1.4587 2.1469 4.9135 9.2352 5.0787 6.1959 2.8307 1.9464 3.5706 5.3521 2.0945 3.5092 1.2303 1.4377 2.1591 1.7739 2.2911 1.4137 1.2155 2.0837 1.5846 2.0793 1.2506 1.2867 1.2388 2.8311 1.8371 1.5308 1.9896 2.9425 2.2085 1.6293 6.8757 1.0950 1.1502 1.1188 1.6654 1.0940 1.0540 4.3082 1.2034 5.9906 1.2245 7.2447 8.4618 8.9265 7.0902 12.4948 1.0325 1.0658 1.0623 1.0595 1.1030 1.0981 1.1023 1.0895 1.1011 1.0968 1.0919 1.0959 1.1004 1.0772 1.0644 1.0446 1.1059
irintensity: 0.1691 0.8368 0.6161 0.1526 3.5990 2.6741 0.7366 5.0062 3.7693 1.1399 1.1392 8.5950 1.7113 0.9311 11.7217 0.8006 1.4013 9.6510 3.6642 0.1740 4.0362 5.7140 5.2197 5.1241 3.6529 3.1358 10.6428 9.8313 7.4239 5.2713 6.4663 6.7167 11.6644 4.4620 13.0612 19.0959 234.2580 11.7184 106.9600 11.1473 25.7424 15.9635 22.9554 12.1121 49.6851 6.6838 65.8081 7.6857 8.0108 17.8411 22.9132 45.9841 94.1459 8.5631 14.1693 10.9415 6.9880 10.3433 15.2636 7.6708 8.1884 6.2356 3.1001 0.3033 1.0153 2.8704 37.7701 24.3444 240.2702 19.1438 66.4875 112.5103 218.7687 142.3291 2.0696 135.3613 4.5787 3.6046 3.4653 9.0140 59.5178 2.9790 6.6122 66.7447 1.3965 44.2779 1.2865 13.5404 12.6545 57.7173 7.6777 43.8203 363.2549 135.9903 0.3261 83.0992 312.2166 34.3580 20.3059 92.4761 259.4908 33.4231 8.7362 5.1775 31.1460 7.1927 104.7767 101.9997 246.4883 172.3119 341.6520 459.1681 58.3763 21.3742 7.1245 3.3315 35.4946 1.1961 3.1443 4.3572 15.0157 6.1827 5.2395 3.4742 0.5300 72.5468 56.7075 84.1081 55.4244
temp: 298.150 k
press: 1.00000 atm
elementType: 16 16 8 8 8 8 8 8 8 7 7 7 6 6 6 6 6 6 6 6 6 6 6 6 6 6 6 6 1 1 1 1 1 1 1 1 1 1 1 1 1 1 1 1 1
symmnumber: 1
zpe: 847170.4 jmol-1
zpe.correction: 0.322670 hartree
zpe.thermalcorrener: 0.351142 hartree
zpe.thermalcorrenthalpy: 0.352086 hartree
zpe.thermalcorrgfe: 0.258602 hartree
zpe.sumelectzpe: -2104.751309 hartree
zpe.sumelectthermal: -2104.722838 hartree
zpe.sumelectthermalent: -2104.721893 hartree
zpe.sumelectthermalfe: -2104.815378 hartree
dipole: 3.3712 2.2571 -3.0841
dipole: 5.0962
quadrupole: -147.2357 -181.0768 -170.2717
quadrupole: 0.8263 32.1572 -7.4656
quadrupole: 18.9591 -14.8821 -4.0770 0.8263 32.1572 -7.4656
hfenergy: -2105.0739796 hartree
pointgroup: C01 [X(C16H17N3O7S2)]
dipole: 1.3246471 1.3381971 0.6888361 debye
polarizability: 291.2895409|-40.9165992|206.8836058|51.6513906|-4.7263926|260.8537819 unknown
InChI: InChI=1S/C16H17N3O7S2/c1-25-16(18-10(20)5-9-3-2-4-27-9)13(23)19-11(12(21)22)8(6-26-15(17)24)7-28-14(16)19/h2-4,14,18,21H,5-7,17H2,1H3
charge 0 multiplicity 1
45 atoms
S  -1.355626 -1.060028 -2.1262
S  4.325711 2.091694 1.675407
O  1.043729 -2.36945 -1.03871
O  0.309563 -1.677025 2.105886
O  -4.739135 2.040211 -0.802107
O  -1.230486 0.75114 2.921892
O  2.331139 0.535519 -2.355399
O  -3.50145 0.281173 2.784425
O  -6.100113 0.686419 -2.185964
N  -0.776701 -0.232865 0.449609
N  2.28354 -0.437302 -0.230602
N  -5.903941 3.006006 -2.496134
C  0.992639 -1.099954 -0.358032
C  -0.179508 -0.225189 -0.915069
C  0.188463 -1.105436 1.00777
C  -2.090418 0.16721 0.776923
C  -3.024901 0.37745 -0.21863
C  -2.725175 0.184159 -1.697836
C  -4.432782 0.85841 0.060422
C  2.880031 0.307504 -1.241644
C  -2.38146 0.379655 2.225795
C  1.868166 -3.394474 -0.367403
C  4.301792 0.840373 -0.92834
C  4.760539 0.77696 0.502369
C  5.525319 -0.197243 1.134986
C  -5.637297 1.811673 -1.870044
C  5.77739 0.060827 2.533272
C  5.208861 1.240112 2.984143
H  0.093104 0.770251 -1.288634
H  2.785654 -0.521283 0.659927
H  -3.629332 -0.190995 -2.208956
H  -2.463715 1.152435 -2.162076
H  -5.163792 0.062587 -0.182131
H  -4.581116 1.191472 1.095058
H  1.774217 -4.289353 -0.999572
H  1.490152 -3.603755 0.65005
H  2.929317 -3.081478 -0.321689
H  4.99296 0.249389 -1.559632
H  4.333376 1.868998 -1.328929
H  -1.438156 0.802364 3.893386
H  5.9125 -1.072711 0.605572
H  6.360752 -0.602655 3.175779
H  5.234726 1.681219 3.978834
H  -6.528111 3.007814 -3.297889
H  -5.496927 3.87187 -2.150681
