program: Gaussian 09
title: 000222339
version: EM64L-G09RevD.01
frameworkgroup: C1[X(C11H22O2)]
method: RPBEPBE
basis: SDD
operation: Freq
keyword: #pfreq=noraman
keyword: PBEPBE/SDD
title: #p freq=noraman PBEPBE/SDD
converged: YES YES NO NO
title: Mulliken charges:
elementType: O O C C C C C C C C C C C H H H H H H H H H H H H H H H H H H H H H H
charge: -0.269160 -0.246833 -0.137230 -0.420250 -0.350106 -0.399842 -0.355131 0.209094 -0.703762 -0.698334 -0.232869 -0.381578 -0.679207 0.226608 0.196800 0.217062 0.203508 0.189461 0.203581 0.223629 0.192908 0.199336 0.228103 0.216259 0.211652 0.216023 0.209799 0.211158 0.219122 0.219369 0.214951 0.215110 0.212551 0.225664 0.212552
chargesum: 0.00000
title: Mulliken charges with hydrogens summed into heavy atoms:
elementType: O O C C C C C C C C C C C
charge: -0.269160 -0.246833 0.089378 -0.006387 0.042862 0.027368 0.037114 0.209094 -0.047749 -0.061354 0.205622 0.048483 -0.028439
polarizability: 1.40115080e+02 -4.63136302e+00 1.32201091e+02 -1.14257216e+00 5.67619935e-01 1.07481484e+02
1716.lowfreq: -15.6779 -8.0723 -0.0009 -0.0006 -0.0003 8.4601 14.6688 36.0315 49.3041
frequency: 11.3164 35.6820 49.2557 54.7782 65.3061 81.5908 87.9361 107.4796 119.5189 154.7570 192.8246 209.9108 223.0062 233.4735 237.7802 258.7671 294.2248 309.8235 328.0576 421.3194 450.3924 512.4435 630.6255 706.0645 729.1106 755.8598 778.8477 788.3909 842.3372 870.3111 878.8481 889.9315 911.0565 931.4209 956.5964 992.9849 1031.5746 1048.8725 1052.0362 1072.6935 1084.1702 1100.3121 1104.2795 1124.4205 1135.7319 1143.8414 1148.8941 1208.7014 1227.6281 1238.6547 1258.1585 1272.0055 1277.0846 1287.9106 1293.4473 1301.1092 1326.3063 1327.1670 1350.1344 1357.7128 1375.0201 1387.3318 1393.3632 1397.5722 1454.5788 1463.3434 1465.7534 1470.2811 1475.3808 1475.9504 1476.9397 1478.3080 1482.3454 1483.4800 1486.2074 1490.7528 1630.6277 2957.7894 2965.3133 2971.9810 2973.9963 2976.5529 2979.4069 2983.5507 2995.9397 2996.6021 3003.2752 3010.6164 3020.5714 3036.9736 3041.8314 3047.7109 3063.9607 3068.8619 3071.2711 3075.0313 3075.4390 3083.6121 3084.3318
redmass: 3.5929 1.9157 3.5125 1.9189 2.4897 2.9765 2.1966 3.4021 2.4080 1.9623 2.9345 1.6256 1.3790 1.1041 1.9740 2.1147 3.4936 4.6584 2.9785 2.9461 3.4240 3.6019 2.6812 2.5591 1.2391 1.0783 1.4079 1.8752 1.8771 2.9017 1.1635 1.9117 1.5209 1.6129 2.3829 3.6060 1.4538 3.1886 2.8412 2.1685 2.0504 2.1148 2.5936 2.3112 2.1978 1.4722 2.5784 1.4871 1.2646 1.2719 1.2244 1.2536 1.1006 1.2104 1.0783 1.3133 1.4608 1.3857 1.5160 1.5437 1.6089 1.2175 1.2164 1.2111 1.0776 1.0772 1.0773 1.0742 1.0662 1.0451 1.0512 1.0591 1.0411 1.0499 1.0797 1.0839 9.1065 1.0587 1.0595 1.0361 1.0590 1.0360 1.0361 1.0602 1.0596 1.0976 1.0582 1.0881 1.1006 1.1025 1.1017 1.1013 1.1044 1.1008 1.0993 1.1005 1.0996 1.0991 1.1045
irintensity: 0.5302 0.0461 1.1419 0.0378 0.0866 0.6335 0.4768 0.8037 0.0845 0.2835 1.7042 1.4441 1.5152 0.1667 2.2233 1.3344 0.6675 12.2899 3.6035 1.1353 1.2898 1.9751 0.0530 3.7218 9.4835 5.6810 8.3708 3.8973 2.8605 11.3919 1.9817 6.5106 0.2738 5.2557 54.7162 16.2236 1.7660 4.8806 12.2504 16.5984 12.3469 75.3550 132.7763 65.1155 1.1237 0.5760 65.4621 5.4756 0.6173 5.0657 6.8806 7.1450 0.0753 0.4391 1.3177 0.5143 1.2705 6.5841 20.6730 7.9851 7.5023 9.5179 13.3448 11.9147 0.2597 6.3087 6.5408 0.9226 7.1555 9.2694 12.6688 3.9342 12.8535 12.5968 18.9613 17.7197 135.7862 2.0130 22.4639 37.5648 55.1327 37.6294 33.5159 50.2166 2.7395 0.3648 40.2075 10.1750 7.7379 5.1809 0.7137 42.0436 0.0586 80.7738 55.7637 65.9338 60.2839 43.0766 89.9194
temp: 298.150 k
press: 1.00000 atm
elementType: 8 8 6 6 6 6 6 6 6 6 6 6 6 1 1 1 1 1 1 1 1 1 1 1 1 1 1 1 1 1 1 1 1 1 1
symmnumber: 1
zpe: 814936.4 jmol-1
zpe.correction: 0.310393 hartree
zpe.thermalcorrener: 0.327752 hartree
zpe.thermalcorrenthalpy: 0.328696 hartree
zpe.thermalcorrgfe: 0.262272 hartree
zpe.sumelectzpe: -581.745878 hartree
zpe.sumelectthermal: -581.728519 hartree
zpe.sumelectthermalent: -581.727575 hartree
zpe.sumelectthermalfe: -581.793999 hartree
dipole: 0.4268 -0.5953 -1.6738
dipole: 1.8271
quadrupole: -74.8346 -79.4848 -87.9642
quadrupole: -3.5670 0.3216 -2.6706
quadrupole: 5.9266 1.2764 -7.2030 -3.5670 0.3216 -2.6706
hfenergy: -582.0562708 hartree
pointgroup: C01 [X(C11H22O2)]
dipole: -0.1712306 0.2392327 -0.6558632 debye
polarizability: 140.0560141|-4.7036525|132.2813407|0.854687|-0.4012216|107.4603008 unknown
InChI: InChI=1S/C11H22O2/c1-4-7-8-10(6-3)11(12)13-9-5-2/h10H,4-9H2,1-3H3
charge 0 multiplicity 1
35 atoms
O  -1.308014 0.056327 -0.330582
O  -0.509982 -0.728373 1.711597
C  0.692274 -1.306874 -0.373048
C  2.069153 -0.688943 0.00626
C  2.17863 0.826564 -0.272143
C  0.683627 -2.844911 -0.145028
C  3.582351 1.392665 0.04135
C  -0.404363 -0.656815 0.463531
C  -0.618454 -3.533738 -0.605129
C  3.688733 2.911282 -0.215294
C  -2.420385 0.745768 0.392027
C  -3.254166 1.478498 -0.659811
C  -4.443991 2.22366 -0.014601
H  0.475768 -1.091702 -1.436637
H  2.852105 -1.225923 -0.566755
H  2.261048 -0.885765 1.079901
H  1.426852 1.372761 0.333892
H  1.928307 1.028495 -1.334273
H  1.545948 -3.274067 -0.69237
H  0.852603 -3.03998 0.931602
H  4.337245 0.858395 -0.571504
H  3.832553 1.176959 1.100171
H  -1.490538 -3.166292 -0.033354
H  -0.55952 -4.627286 -0.456488
H  -0.813999 -3.346005 -1.677571
H  4.700223 3.291763 0.017912
H  3.472434 3.151496 -1.273439
H  2.96569 3.469274 0.409196
H  -3.009174 -0.01508 0.937975
H  -1.981834 1.436599 1.13636
H  -2.605977 2.191904 -1.202326
H  -3.620527 0.747268 -1.404512
H  -5.117076 1.524051 0.515541
H  -5.040397 2.747911 -0.782005
H  -4.098043 2.978107 0.716655
