program: Gaussian 09
title: 000222319
version: EM64L-G09RevD.01
frameworkgroup: C1[X(C9H9ClO2)]
method: RPBEPBE
basis: SDD
operation: Freq
keyword: #p
keyword: freq=noraman
keyword: PBEPBE/SDD
title: #p freq=noraman PBEPBE/SDD
converged: NO YES NO NO
title: Mulliken charges:
elementType: Cl O O C C C C C C C C C H H H H H H H H H
charge: -0.009137 -0.291003 -0.190082 0.439726 0.359939 -0.356855 -0.371508 -0.388970 -0.313851 -0.803361 0.312020 -0.690919 0.236665 0.234969 0.253843 0.299260 0.228056 0.225642 0.238464 0.293401 0.293703
chargesum: 0.00000
title: Mulliken charges with hydrogens summed into heavy atoms:
elementType: Cl O O C C C C C C C C C
charge: -0.009137 -0.291003 -0.190082 0.439726 0.359939 -0.120190 -0.136539 -0.135127 -0.014591 -0.111200 0.312020 -0.103815
polarizability: 1.78056320e+02 5.43735643e+00 1.07855118e+02 6.26191754e-01 2.48092157e-01 5.29193579e+01
1716.lowfreq: -29.0778 -6.7465 -0.0021 -0.0020 0.0019 3.7816 14.1102 21.4244 36.5734
frequency: -27.8795 21.3425 36.3014 54.7463 90.9493 157.2543 223.2737 240.7861 294.7109 338.5694 370.1969 412.1819 487.5182 503.0978 530.9396 621.1596 672.7038 684.3088 709.5146 764.8708 805.4667 828.6000 844.4552 902.6131 912.2279 956.6510 980.0162 988.2537 1009.0536 1047.7637 1096.7474 1122.5809 1150.8057 1152.5959 1196.7104 1223.5029 1279.9150 1305.6885 1372.9680 1398.7400 1408.0374 1422.0083 1472.5023 1473.8763 1491.8463 1589.3044 1617.7442 1675.2464 2976.8253 3058.3501 3059.1229 3087.1944 3130.8014 3133.5138 3134.7520 3167.3781 3207.6448
redmass: 1.0349 5.3961 5.6516 3.3779 7.4647 4.5021 7.5152 7.2857 5.9261 4.4584 3.2514 2.9613 7.6555 2.6165 3.0615 7.0774 7.0274 6.4904 3.2377 6.3036 6.0721 1.4189 1.2539 6.9283 1.7825 1.3224 1.3451 1.3961 2.9875 1.5579 3.8244 1.2999 1.2121 2.1654 1.2902 3.5172 1.3982 1.2751 6.4060 1.2218 3.0695 1.0895 1.0940 1.0595 2.5479 6.6496 6.4499 10.9397 1.0388 1.0949 1.0571 1.0998 1.0901 1.0906 1.1074 1.0958 1.0944
irintensity: 0.6377 1.7828 1.9977 6.3902 1.4746 0.0246 1.2709 0.1634 4.8767 4.2995 1.0956 0.0922 6.1559 22.6977 0.2892 1.3543 7.6042 14.9570 0.4934 22.7787 3.9446 64.3961 11.7920 42.8069 7.2241 5.2933 1.6593 0.3056 12.2360 24.3423 420.5261 31.9534 22.8983 214.0745 69.5101 11.6740 22.9145 1.2140 4.4764 11.5062 5.0775 28.2421 14.9553 13.2024 118.8626 2.0176 0.9184 173.5060 33.7946 22.2606 9.2037 17.1407 17.5821 14.8230 1.4036 5.1966 2.3916
temp: 298.150 k
press: 1.00000 atm
elementType: 17 8 8 6 6 6 6 6 6 6 6 6 1 1 1 1 1 1 1 1 1
symmnumber: 1
zpe: 412089.2 jmol-1
zpe.correction: 0.156956 hartree
zpe.thermalcorrener: 0.168173 hartree
zpe.thermalcorrenthalpy: 0.169117 hartree
zpe.thermalcorrgfe: 0.117053 hartree
zpe.sumelectzpe: -957.984771 hartree
zpe.sumelectthermal: -957.973554 hartree
zpe.sumelectthermalent: -957.972610 hartree
zpe.sumelectthermalfe: -958.024674 hartree
dipole: 3.3059 2.4594 0.0734
dipole: 4.1211
quadrupole: -74.1860 -73.4165 -78.5737
quadrupole: -7.3902 0.2073 0.3019
quadrupole: 1.2060 1.9756 -3.1816 -7.3902 0.2073 0.3019
hfenergy: -958.1417272 hartree
pointgroup: C01 [X(C9H9Cl1O2)]
dipole: -1.2117423 1.0564417 0.2106555 debye
dipolederiv: -0.4341626 0.0948118 -0.0051926 0.1660765 -0.1769297 0.0068698 0.0144577 -0.002019 -0.1304574 -2.2535417 0.4265036 -0.0690146 0.6160545 -0.5505775 -0.0776285 0.0052555 -0.0999477 -0.2169194 -0.6349526 -0.075047 -0.0687718 0.4736969 -0.8080033 -0.1575211 0.1529725 -0.2165997 -0.3449227 0.3919029 0.0197076 0.0755404 -0.0192308 -0.0792787 -0.0167828 0.1414758 -0.0143982 -0.0190478 1.3026037 -0.1239243 0.0908646 0.0846957 0.0873808 0.0083888 0.1799604 -0.0129958 0.0890724 -0.0792937 -0.0405017 -0.002562 -0.1542456 0.0728986 0.0585536 -0.0497355 0.0719416 -0.1485375 -0.1586575 0.0178163 0.0086319 0.1272853 0.0864202 0.1082864 0.0358045 0.0970186 -0.1247714 -0.2252839 0.0339426 0.0075977 0.0655489 -0.0030888 0.0687388 0.0077858 0.0617981 -0.1357503 -0.2316084 0.004812 -0.0076219 -0.0612396 -0.0866679 0.0057617 -0.0397619 0.0183319 -0.1380674 -0.1337293 -0.0065733 -0.0379013 0.0269436 0.0777012 0.0068876 -0.1510605 0.0042132 0.0510571 1.9713512 -0.2351606 0.0941009 -0.865376 1.1271599 0.2707129 -0.1736846 0.335669 0.3279698 0.3366263 -0.2821075 -0.067726 -0.5611717 0.1592498 -0.0708569 -0.1519666 -0.0361066 0.1250462 -0.0091356 0.1062536 0.0216573 0.0961106 -0.0233451 -0.0480302 0.0213781 -0.0516367 0.1362782 0.020719 -0.0719785 -0.0358582 -0.0788218 -0.0353105 -0.0739087 -0.035785 -0.0687099 0.1202324 0.0707942 -0.0700556 -0.0359054 -0.0731873 0.0102176 -0.065659 -0.0349856 -0.066418 0.1453826 0.1310377 0.0504667 0.0114478 0.0475756 0.0737814 -0.0309882 0.0118072 -0.0323173 0.1736498 0.0205524 -0.0233469 -0.0000707 -0.1233529 -0.1101852 0.027292 0.027462 0.0185926 0.1089595 -0.0099054 0.0314839 0.0358039 0.0917046 0.0093961 -0.107201 0.1155907 -0.0920958 0.0130002 -0.0229918 0.0083602 -0.0479722 0.0211423 0.0947863 0.0657475 -0.1011445 0.0623256 -0.0967339 -0.024594 0.0708451 0.0372581 0.0684258 0.0804262 -0.0449992 0.0128805 -0.0487251 -0.0088058 -0.0277308 0.0636918 -0.0043058 0.0513654 -0.0060314 0.0663363 0.0112937 0.0720794 0.0733652 unknown
polarizability: 175.2638775|-14.7017808|103.7922098|9.27724|16.2725332|59.7747087 unknown
InChI: InChI=1S/C9H9ClO2/c1-7-2-4-8(5-3-7)12-9(11)6-10/h2-5H,6H2,1H3
charge 0 multiplicity 1
21 atoms
Cl 5.065104 -0.898621 0.380667
O  1.260614 0.415119 0.415324
O  2.156655 -1.651432 -0.297457
C  -2.94269 0.033469 -0.204074
C  -0.136006 0.188818 0.168009
C  -2.336988 1.22296 0.280641
C  -2.101178 -1.070762 -0.488332
C  -0.942966 1.307348 0.466705
C  -0.699582 -1.014663 -0.311672
C  -4.441967 -0.043443 -0.432461
C  2.288538 -0.505907 0.161487
C  3.582254 0.201198 0.562121
H  -2.962287 2.091983 0.516406
H  -2.544524 -2.003373 -0.857262
H  -0.471155 2.220229 0.842597
H  -0.071891 -1.876929 -0.537973
H  -4.819567 -1.072339 -0.299438
H  -4.992427 0.614781 0.262472
H  -4.704238 0.272063 -1.46108
H  3.528027 0.519047 1.613894
H  3.741974 1.082153 -0.077871
