program: Gaussian 09
title: 000222316
version: EM64L-G09RevD.01
frameworkgroup: C1[X(C8H6Cl2O2)]
method: RPBEPBE
basis: SDD
operation: Freq
keyword: #p
keyword: freq=noraman
keyword: PBEPBE/SDD
title: #p freq=noraman PBEPBE/SDD
converged: YES YES NO NO
title: Mulliken charges:
elementType: Cl Cl O O C C C C C C C C H H H H H H
charge: -0.044184 -0.001839 -0.318663 -0.163629 0.418527 -0.328519 -0.329347 -0.177760 -0.177457 -0.112871 0.291334 -0.676919 0.253884 0.253843 0.261351 0.261339 0.295454 0.295456
chargesum: 0.00000
title: Mulliken charges with hydrogens summed into heavy atoms:
elementType: Cl Cl O O C C C C C C C C
charge: -0.044184 -0.001839 -0.318663 -0.163629 0.418527 -0.074635 -0.075503 0.083591 0.083882 -0.112871 0.291334 -0.086009
polarizability: 1.67420716e+02 -5.91594982e-02 8.85005618e+01 5.29267838e+00 2.92796923e-01 6.53990433e+01
1716.lowfreq: -41.3317 -10.2055 -5.5660 -0.0025 -0.0021 -0.0018 3.1442 18.5632 44.5236
frequency: -41.2735 18.5356 44.5173 57.3208 132.0582 205.0181 236.9472 247.0777 325.9107 394.1762 399.1806 412.3152 488.9475 529.5442 602.2917 622.2148 644.7594 703.9151 739.5373 781.0242 814.0045 836.6102 882.3543 912.7211 944.9400 956.4385 996.0912 1060.6239 1073.2379 1099.6139 1152.2050 1157.1446 1178.6033 1281.8717 1281.9883 1373.0323 1390.5515 1421.6828 1465.7216 1591.5511 1598.3370 1702.8870 3060.4356 3134.9379 3162.1828 3162.2216 3180.5133 3183.8970
redmass: 5.8978 5.8513 15.9721 3.6805 10.1918 10.2182 14.8506 8.6847 7.4588 4.7739 12.6167 2.9373 3.2357 3.1477 9.0752 7.2014 5.7470 3.9162 6.6040 4.2735 1.2449 1.9514 5.9760 1.7897 1.3750 1.3627 4.2370 3.3120 3.2719 1.2992 1.1089 1.8982 1.6948 1.3753 1.2448 7.4494 3.5251 1.0849 2.3841 6.5090 8.2189 11.3760 1.0572 1.1071 1.0891 1.0893 1.0972 1.0981
irintensity: 0.9533 2.1860 0.5855 4.9349 0.9061 0.7967 3.3945 2.5538 2.0879 1.6968 11.5097 0.0172 31.1867 2.7137 4.6558 0.2560 6.7775 0.0383 58.6152 7.6600 0.0433 54.4895 99.1217 7.2504 1.0088 0.0496 105.5180 401.1556 113.8235 12.3856 0.3452 77.7979 47.2161 21.3591 0.5231 0.5716 3.4285 36.2331 146.9209 3.4961 0.2810 146.1024 9.7855 0.8251 4.0158 0.7614 3.0371 0.2113
temp: 298.150 k
press: 1.00000 atm
elementType: 17 17 8 8 6 6 6 6 6 6 6 6 1 1 1 1 1 1
symmnumber: 1
zpe: 314867.2 jmol-1
zpe.correction: 0.119927 hartree
zpe.thermalcorrener: 0.130615 hartree
zpe.thermalcorrenthalpy: 0.131559 hartree
zpe.thermalcorrgfe: 0.080350 hartree
zpe.sumelectzpe: -1378.141883 hartree
zpe.sumelectthermal: -1378.131195 hartree
zpe.sumelectthermalent: -1378.130250 hartree
zpe.sumelectthermalfe: -1378.181460 hartree
dipole: 0.2004 0.1133 -2.9671
dipole: 2.9760
quadrupole: -93.9780 -72.4391 -88.3987
quadrupole: -0.2917 7.7790 0.3798
quadrupole: -9.0394 12.4995 -3.4601 -0.2917 7.7790 0.3798
hfenergy: -1378.2618099 hartree
pointgroup: C01 [X(C8H6Cl2O2)]
dipole: 0.0743029 0.0372055 -1.1678886 debye
dipolederiv: -0.8274588 0.0034429 -0.1374085 0.0042278 -0.1203308 -0.0002028 -0.1692685 -0.0001652 -0.0922512 -0.412209 -0.0036326 0.0841629 -0.0075892 -0.1243785 0.0022692 0.1741889 0.0025346 -0.17855 -2.1495177 -0.0075947 0.3387394 -0.0080677 -0.2596686 0.0077497 0.3432448 0.0076403 -0.6016795 -0.6163953 0.0033525 -0.1354784 -0.0072214 -0.2433336 0.0146789 0.3649977 0.0137014 -0.8515267 1.3027448 0.0007405 -0.0315616 -0.0070018 0.1671032 0.0032051 0.3183643 0.0031606 0.0068775 -0.180536 0.0380666 0.0570114 0.0398747 0.0128117 0.0157888 -0.0178415 -0.0056465 -0.1060075 -0.1807911 -0.0397694 0.0560823 -0.0381811 0.0135172 -0.0119541 -0.0179327 0.0089322 -0.106513 -0.275461 -0.0573294 -0.0246369 -0.0559722 0.0195389 -0.0188183 -0.0392063 -0.0122253 -0.0959858 -0.2750813 0.0590455 -0.022681 0.0587268 0.0175613 0.0226796 -0.0370847 0.0159583 -0.0950954 1.2130177 -0.006255 0.2539096 -0.0071641 0.0834286 0.0010296 0.288822 0.0011363 -0.0158653 1.9264644 0.0020125 -0.1808039 0.0106328 0.1904978 -0.0252043 -0.7103103 -0.0230115 1.274017 0.2692469 0.0116528 -0.2855081 0.0224366 0.151292 -0.0006784 -0.5331377 -0.0017413 0.1441347 0.0496525 -0.0727603 -0.0367248 -0.0750472 0.0088882 -0.0132055 -0.0274282 -0.0121527 0.151873 0.0504543 0.0739151 -0.034266 0.0758758 0.0073758 0.0084616 -0.0249748 0.0076656 0.1528284 0.048715 0.0603302 -0.0157863 0.0554426 0.0078103 0.0075506 -0.0237606 0.0093866 0.1626393 0.0482082 -0.0601256 -0.0178789 -0.0548245 0.0089365 -0.0125914 -0.0255534 -0.0143966 0.1619568 0.0049055 0.0185296 0.067623 -0.0053874 0.0346244 -0.0766745 0.0688276 -0.065046 0.0393644 0.0040409 -0.0236211 0.0652059 -0.0007606 0.0243256 0.0759163 0.0680534 0.0642694 0.0497833 unknown
polarizability: 167.4600485|0.0325772|88.5033527|4.8989007|0.14987|65.3569197 unknown
InChI: InChI=1S/C8H6Cl2O2/c9-5-8(11)12-7-3-1-6(10)2-4-7/h1-4H,5H2
charge 0 multiplicity 1
18 atoms
Cl 4.64958 -0.014396 0.521599
Cl -4.986058 -0.026776 0.601496
O  -1.222123 0.02118 -0.878234
O  -1.975295 -0.031309 1.352481
C  0.160865 0.011778 -0.487309
C  0.825547 -1.222521 -0.356894
C  0.830677 1.238221 -0.315656
C  2.203567 -1.232743 -0.047147
C  2.208772 1.232186 -0.006033
C  2.872109 -0.004165 0.123144
C  -2.214283 -0.001451 0.140254
C  -3.557397 0.019994 -0.579211
H  0.27895 -2.159786 -0.496446
H  0.288133 2.181965 -0.423891
H  2.742401 -2.178019 0.059756
H  2.751643 2.17106 0.132114
H  -3.641023 -0.853847 -1.242387
H  -3.646768 0.939329 -1.177136
