program: Gaussian 09
title: 000222279
version: EM64L-G09RevD.01
frameworkgroup: C1[X(C10H15BrO)]
method: RPBEPBE
basis: SDD
operation: Freq
keyword: #p
keyword: freq=noraman
keyword: PBEPBE/SDD
title: #p freq=noraman PBEPBE/SDD
converged: NO YES NO NO
title: Mulliken charges:
elementType: Br O C C C C C C C C C C H H H H H H H H H H H H H H H
charge: 0.004008 -0.150825 0.310270 0.236737 -0.184825 -0.529332 -0.470024 -0.647914 0.155326 -0.774253 -0.768668 -0.803717 0.264435 0.245196 0.250569 0.248297 0.236429 0.336984 0.219928 0.237962 0.221199 0.223814 0.223426 0.230678 0.242727 0.228300 0.213273
chargesum: 0.00000
title: Mulliken charges with hydrogens summed into heavy atoms:
elementType: Br O C C C C C C C C C C
charge: 0.004008 -0.150825 0.310270 0.236737 0.079610 -0.033567 0.014702 -0.310930 0.155326 -0.095165 -0.090750 -0.119416
polarizability: 1.45418168e+02 -7.90704676e-01 1.09365835e+02 3.67813731e+00 7.05430479e-01 1.01477015e+02
1716.lowfreq: -11.7907 -4.6518 -0.0007 -0.0007 -0.0004 7.1510 63.8158 133.2597 136.9053
frequency: 63.6946 133.2587 136.8944 150.4785 171.6165 188.0971 203.4209 228.0965 231.1869 262.4973 282.4530 319.9975 380.6240 404.3779 463.7206 492.1534 533.8093 559.0343 586.6630 668.6691 689.5660 750.3543 790.5368 822.4348 848.0627 873.8064 905.5790 938.6321 945.3509 960.8427 987.5163 1001.0492 1023.6170 1047.4772 1082.2547 1103.3522 1125.6379 1154.2029 1168.2429 1190.1303 1192.9260 1208.4175 1220.9737 1234.4071 1266.2113 1285.0178 1301.9677 1312.8592 1386.1292 1390.5889 1405.2203 1459.2827 1463.9208 1467.5769 1473.2525 1478.9393 1488.3453 1490.3669 1499.9442 1668.3832 2978.2313 2983.3133 2985.8319 3004.3665 3031.1482 3062.9104 3064.1609 3065.4223 3070.5888 3074.9999 3078.9805 3082.0103 3082.5976 3092.0101 3097.8826
redmass: 5.0948 4.7366 1.5284 1.5901 1.3791 1.9281 2.3012 2.6202 1.6636 2.9890 2.5200 2.5874 2.6304 2.6483 3.5647 3.6529 3.4325 4.0326 4.1802 4.2031 4.5135 2.3618 3.3775 1.8350 2.1363 2.7754 2.2533 1.9189 1.3922 2.2807 1.4486 1.7018 2.4940 1.9917 1.3032 1.7875 1.8572 2.1659 1.4553 1.7202 1.5520 1.9700 2.0088 1.3820 2.5334 1.7199 1.5930 2.2076 1.1964 1.2357 1.1892 1.0582 1.0507 1.0516 1.0538 1.0591 1.0638 1.0690 1.0619 12.0922 1.0365 1.0372 1.0363 1.0613 1.0629 1.1020 1.0982 1.0911 1.0981 1.0943 1.0991 1.0905 1.0980 1.1021 1.0983
irintensity: 0.9466 1.2878 0.0896 0.7519 0.2302 0.0813 0.1764 1.4470 0.2717 2.8610 1.3567 1.1280 0.7220 2.3210 0.9879 1.7310 2.8448 3.2063 6.9481 8.2280 8.8819 56.3810 6.3154 4.4728 0.2289 1.1857 9.3043 4.8110 1.3057 4.1846 3.3359 22.8181 13.4949 4.7254 0.3832 12.0138 1.4081 3.3650 3.6668 2.6343 4.1125 5.7449 2.9871 2.1517 9.8200 5.2594 2.4797 4.4715 15.7637 18.1055 21.1404 8.0820 8.0055 7.0314 6.6113 8.5721 13.9750 8.6812 9.3045 155.4720 21.2081 22.6851 36.3590 27.8065 32.8203 5.6237 1.1282 10.1848 43.0010 50.2334 21.2533 10.3488 14.4725 42.8945 20.0168
temp: 298.150 k
press: 1.00000 atm
elementType: 35 8 6 6 6 6 6 6 6 6 6 6 1 1 1 1 1 1 1 1 1 1 1 1 1 1 1
symmnumber: 1
zpe: 594057.0 jmol-1
zpe.correction: 0.226264 hartree
zpe.thermalcorrener: 0.238885 hartree
zpe.thermalcorrenthalpy: 0.239829 hartree
zpe.thermalcorrgfe: 0.187702 hartree
zpe.sumelectzpe: -477.805236 hartree
zpe.sumelectthermal: -477.792616 hartree
zpe.sumelectthermalent: -477.791671 hartree
zpe.sumelectthermalfe: -477.843799 hartree
dipole: 3.7651 -3.0826 -0.0187
dipole: 4.8661
quadrupole: -83.3183 -89.6208 -78.6192
quadrupole: 1.4776 0.6174 -1.1405
quadrupole: 0.5345 -5.7681 5.2336 1.4776 0.6174 -1.1405
hfenergy: -478.0315008 hartree
pointgroup: C01 [X(C10H15Br1O1)]
dipole: 1.7102398 -0.8597691 -0.0329329 debye
polarizability: 144.1688664|7.0649379|110.8021722|2.2700147|1.1491595|101.2899796 unknown
InChI: InChI=1S/C10H15BrO/c1-9(2)6-4-5-10(9,3)8(12)7(6)11/h6-7H,4-5H2,1-3H3
charge 0 multiplicity 1
27 atoms
Br -3.159632 -0.92161 0.162424
O  -1.475082 2.02777 0.231969
C  1.116486 -0.428838 0.502992
C  0.568433 0.733035 -0.425873
C  -0.144931 -1.362541 0.262421
C  0.238561 -0.04478 -1.761615
C  -0.192518 -1.475607 -1.287415
C  -1.280093 -0.423217 0.734454
C  -0.831136 0.958689 0.184243
C  2.439011 -1.060555 0.011184
C  1.326158 0.004926 1.977618
C  1.393646 2.003864 -0.600693
H  -0.122785 -2.325112 0.797706
H  1.144241 -0.070884 -2.394215
H  -0.550515 0.465585 -2.340922
H  -1.1993 -1.750139 -1.64065
H  0.50536 -2.252236 -1.642466
H  -1.376965 -0.388629 1.831611
H  3.268317 -0.336898 0.115641
H  2.409525 -1.386091 -1.040938
H  2.690682 -1.943139 0.629174
H  2.253915 0.598447 2.069762
H  1.435321 -0.881621 2.630011
H  0.507658 0.625751 2.383085
H  0.838275 2.743524 -1.204055
H  1.614617 2.47929 0.371772
H  2.350453 1.789617 -1.110526
