program: Gaussian 09
title: 000222271
version: EM64L-G09RevD.01
frameworkgroup: C1[X(C9H16N2O2)]
method: RPBEPBE
basis: SDD
operation: Freq
keyword: #p
keyword: freq=noraman
keyword: PBEPBE/SDD
title: #p freq=noraman PBEPBE/SDD
converged: NO YES NO NO
title: Mulliken charges:
elementType: O O N N C C C C C C C C C H H H H H H H H H H H H H H H H
charge: -0.190365 -0.215750 -0.446446 -0.646088 0.005324 -0.431571 -0.431993 -0.403206 -0.403467 -0.384163 -0.608593 0.253762 0.283226 0.248342 0.184452 0.198478 0.228046 0.173056 0.197774 0.199121 0.199888 0.199186 0.201737 0.185472 0.243092 0.200793 0.303363 0.309615 0.346917
chargesum: 0.00000
title: Mulliken charges with hydrogens summed into heavy atoms:
elementType: O O N N C C C C C C C C C
charge: -0.190365 -0.215750 -0.143083 0.010444 0.253666 -0.048641 -0.030891 -0.006311 -0.004393 0.003046 -0.164709 0.253762 0.283226
polarizability: 1.41878575e+02 -9.11042106e+00 9.73131788e+01 5.41532419e+00 2.07446677e+00 1.06393431e+02
1716.lowfreq: -20.1005 -10.3069 -0.0005 -0.0003 0.0000 3.6767 15.2381 28.6640 46.0772
frequency: 13.1891 28.1584 45.6026 83.2641 130.0312 148.0215 193.8393 212.9543 239.2144 312.0965 348.0027 378.5141 407.8101 414.0438 429.3086 434.8137 519.5416 520.8912 550.3909 609.7454 632.2595 706.4598 738.1305 778.7836 790.4016 835.4609 847.0142 881.3858 895.5488 913.7332 936.6438 954.3533 975.8182 1049.0714 1053.4961 1057.7598 1073.8150 1084.3286 1099.3701 1114.1810 1156.1608 1179.5228 1218.5316 1250.3078 1257.8002 1261.1468 1274.8776 1291.7705 1313.5731 1321.6502 1334.1101 1338.1698 1340.4937 1347.4326 1360.7429 1427.5158 1447.6015 1458.6853 1461.6649 1463.4437 1468.4350 1475.6883 1605.6881 1644.9225 1697.8847 2944.5585 2948.1200 2963.3552 2966.7460 2968.7552 2970.4093 2983.2334 3014.7283 3023.4714 3027.9752 3030.9985 3038.9432 3043.3391 3524.8192 3531.7472 3682.8096
redmass: 4.6870 5.9306 3.4726 4.6929 3.3767 4.4210 4.2403 1.9779 3.6043 1.7680 2.8699 2.0876 2.0326 2.0364 2.5354 2.7179 1.9772 2.6049 1.1943 1.1586 3.2256 7.3544 5.3420 1.7880 2.0963 1.6885 2.4525 2.6989 1.5840 1.9866 2.2243 2.5011 3.1185 1.9478 1.9147 1.1308 1.5945 2.2556 1.5130 2.5983 2.2186 1.5306 1.5466 1.2592 1.2697 1.2399 1.3336 2.7671 1.2980 1.4419 1.3724 1.5541 1.4991 1.4720 1.4926 2.0736 1.1265 1.0910 1.0930 1.0888 1.0808 1.0965 1.2027 5.0516 7.0802 1.0638 1.0636 1.0630 1.0642 1.0631 1.0628 1.0779 1.0967 1.0979 1.0942 1.1022 1.1010 1.1024 1.0594 1.0624 1.1040
irintensity: 5.7489 9.8051 2.3569 2.7538 2.3502 0.5822 0.6440 0.0714 0.3183 0.2296 0.5422 28.2763 25.2538 14.4542 11.8977 17.6584 22.9330 26.2070 205.6216 77.7601 0.9722 25.9376 20.5037 1.4973 3.6853 3.4810 2.0589 4.5189 13.8120 0.5083 25.6080 1.6151 4.2518 0.9850 21.7558 0.0245 3.6996 12.9460 65.9595 1.2479 72.2906 24.5656 68.3755 2.0350 1.8752 1.4379 74.3600 99.5943 0.6648 3.8380 0.0655 2.3981 0.4014 0.9850 1.7735 662.9683 26.4674 4.4096 8.6199 10.7479 21.8394 1.4995 58.9537 39.4163 381.3057 22.5262 36.6522 34.6776 24.6876 30.6597 22.0400 29.6442 68.2711 46.0184 45.3575 26.3208 8.9492 141.1142 19.3708 30.3366 32.1072
temp: 298.150 k
press: 1.00000 atm
elementType: 8 8 7 7 6 6 6 6 6 6 6 6 6 1 1 1 1 1 1 1 1 1 1 1 1 1 1 1 1
symmnumber: 1
zpe: 648969.8 jmol-1
zpe.correction: 0.247180 hartree
zpe.thermalcorrener: 0.260752 hartree
zpe.thermalcorrenthalpy: 0.261696 hartree
zpe.thermalcorrgfe: 0.204605 hartree
zpe.sumelectzpe: -611.514885 hartree
zpe.sumelectthermal: -611.501313 hartree
zpe.sumelectthermalent: -611.500368 hartree
zpe.sumelectthermalfe: -611.557459 hartree
dipole: 0.4170 -0.6528 -6.8546
dipole: 6.8982
quadrupole: -69.1150 -79.9885 -80.9172
quadrupole: 1.0615 20.7181 1.5787
quadrupole: 7.5586 -3.3150 -4.2436 1.0615 20.7181 1.5787
hfenergy: -611.7620643 hartree
pointgroup: C01 [X(C9H16N2O2)]
dipole: -0.1596077 1.4144439 -2.3107409 debye
polarizability: 141.7201614|-6.1752018|100.7939291|-9.0262352|-4.7603533|103.0710937 unknown
InChI: InChI=1S/C9H16N2O2/c10-9(13)11-8(12)6-7-4-2-1-3-5-7/h7,11H,1-6,10H2
charge 0 multiplicity 1
29 atoms
O  1.29151 0.241445 1.832145
O  3.565359 -1.184657 0.586348
N  2.15256 0.495804 -0.346297
N  4.294607 0.10298 -1.215373
C  -1.367547 0.520751 0.350997
C  -2.64836 1.364231 0.129435
C  -1.351298 -0.706659 -0.594501
C  -3.928248 0.508032 0.287261
C  -2.63037 -1.564823 -0.440481
C  -3.907021 -0.717373 -0.656168
C  -0.094083 1.39552 0.179833
C  1.16275 0.654524 0.654483
C  3.363655 -0.266769 -0.241856
H  -1.366899 0.153057 1.398173
H  -2.626023 1.801151 -0.892484
H  -2.668367 2.213557 0.841598
H  -0.455835 -1.327261 -0.39569
H  -1.275589 -0.350564 -1.645338
H  -4.824817 1.127909 0.091576
H  -4.003436 0.157636 1.337297
H  -2.650671 -2.002921 0.578557
H  -2.605507 -2.412893 -1.151881
H  -4.809895 -1.337941 -0.495715
H  -3.940426 -0.367973 -1.709485
H  -0.19638 2.300949 0.809072
H  -0.008881 1.728361 -0.874799
H  1.948274 0.919392 -1.254437
H  4.242872 0.976548 -1.736543
H  5.157465 -0.436616 -1.248628
