program: Gaussian 09
title: 000222270
version: EM64L-G09RevD.01
frameworkgroup: C1[X(C20H23NO3)]
method: RPBEPBE
basis: SDD
operation: Freq
keyword: #p
keyword: freq=noraman
keyword: PBEPBE/SDD
title: #p freq=noraman PBEPBE/SDD
converged: YES YES NO NO
title: Mulliken charges:
elementType: O O O N C C C C C C C C C C C C C C C C C C C C H H H H H H H H H H H H H H H H H H H H H H H
charge: -0.247027 -0.416058 -0.231220 -0.095077 0.026714 -0.467358 -0.385276 -0.341688 -0.348932 0.412134 0.367234 -0.323203 -0.318520 0.086115 -0.379087 -0.345383 -0.388897 -0.402479 -0.248235 -0.243883 -0.255674 -0.250036 -0.245148 -0.243138 0.234736 0.235678 0.190427 0.231952 0.190872 0.214245 0.213730 0.188180 0.191247 0.212355 0.212754 0.191585 0.253228 0.268741 0.253967 0.255244 0.225495 0.228712 0.225916 0.226183 0.380457 0.228422 0.229998
chargesum: 0.00000
title: Mulliken charges with hydrogens summed into heavy atoms:
elementType: O O O N C C C C C C C C C C C C C C C C C C C C
charge: -0.247027 -0.035601 -0.231220 -0.095077 0.026714 0.003055 0.037103 0.063428 0.052978 0.412134 0.367234 0.080399 0.085819 0.086115 -0.125860 -0.076642 -0.134930 -0.147236 -0.022740 -0.015171 -0.029759 -0.023852 -0.016726 -0.013140
polarizability: 2.37386161e+02 -5.35268208e+00 2.45179912e+02 -1.04698190e+01 1.42324825e+01 1.89564910e+02
1716.lowfreq: -5.1746 -2.5132 -1.3390 -0.0005 0.0005 0.0007 23.3756 31.4413 38.4331
frequency: 23.1787 31.3479 38.3977 42.7772 46.1218 64.0429 67.1011 92.1643 103.0567 137.7331 155.3830 189.5924 224.0368 234.1994 244.2111 260.0250 288.4371 299.1778 313.5091 349.6095 354.6330 389.6065 400.1636 403.5105 416.7224 430.6489 470.2208 488.6610 492.0123 556.4971 591.1442 597.9006 614.3576 616.6795 624.7113 632.8161 692.4554 699.0663 702.8068 707.1225 759.7352 766.2805 769.6564 795.3969 808.5388 841.3396 851.3296 854.5844 879.2735 889.5072 901.7788 925.8577 934.5425 976.7710 981.4567 990.5634 991.1399 994.6612 998.1664 999.6895 1014.9591 1027.4636 1029.2294 1030.1384 1047.4227 1053.9371 1070.3732 1080.6781 1088.7623 1091.8286 1103.6069 1115.8060 1137.3309 1142.9764 1166.1869 1173.7840 1174.3130 1190.5390 1196.8825 1200.0401 1202.8015 1231.2753 1258.8409 1271.4555 1290.7717 1294.0836 1307.6906 1311.5083 1323.9072 1327.1072 1332.9609 1346.2869 1364.5592 1370.3180 1374.4568 1380.2119 1394.7252 1433.4313 1435.4287 1443.8098 1449.4775 1450.4385 1457.2523 1461.5946 1476.0961 1481.9320 1485.0013 1587.9324 1591.3685 1606.9827 1611.3225 1639.3447 2852.5144 2860.0696 2872.7756 2953.8019 2957.3713 3016.4864 3027.9147 3038.3841 3041.4984 3078.3804 3081.5583 3087.8402 3120.7367 3124.7148 3129.2875 3132.8944 3142.0669 3145.4632 3157.9710 3158.1593 3168.8544 3173.1847 3509.5758
redmass: 4.5916 3.4416 4.9854 3.9272 4.0901 7.2847 4.6542 5.1931 4.8410 4.3864 4.8792 5.2615 3.3336 3.5155 2.2236 3.5022 3.4604 5.3636 2.4577 4.2528 3.7385 2.2040 2.8043 2.8261 3.0868 5.7180 2.7763 3.4696 3.9005 2.2595 2.0075 3.1396 5.4725 5.6591 3.7688 2.3877 4.6491 3.0412 1.6860 2.0366 2.1409 2.4256 1.7977 2.0996 3.0463 1.6066 1.2550 1.2521 2.4140 4.7094 2.1935 1.5574 1.5890 1.3953 1.3893 6.1226 4.3435 1.4445 1.3204 2.7442 2.3955 2.2546 2.6559 2.2816 3.5325 2.1504 2.4215 2.2587 2.4057 1.9331 2.2990 2.3559 2.6634 2.4244 3.6376 1.0546 1.0514 1.0807 1.2589 1.2221 1.5546 1.4603 1.4315 1.3265 1.9111 1.3592 1.3158 1.2273 1.3614 1.3332 1.2549 1.2881 1.4344 1.2793 5.9914 6.7334 1.4345 2.2431 2.2187 1.0826 1.0814 1.0938 1.0909 1.1128 1.1175 2.0679 2.0757 5.9236 6.0848 5.9507 5.9693 8.9844 1.0705 1.0706 1.0689 1.0663 1.0664 1.0607 1.0900 1.0878 1.0890 1.0962 1.0980 1.1012 1.0852 1.0848 1.0880 1.0884 1.0937 1.0936 1.0961 1.0978 1.0991 1.0968 1.0639
irintensity: 0.1845 0.0883 0.3119 0.0837 0.0646 0.7700 0.0819 0.8254 1.2205 0.3752 1.7386 0.2926 3.9540 0.5806 2.1434 1.8027 1.6721 0.3739 10.5591 1.5296 4.5982 0.8956 0.1104 0.0519 3.3675 1.8845 0.8740 1.7676 11.2447 16.9290 9.8011 66.6300 3.4362 4.7639 15.8540 98.3319 1.6347 37.2137 67.4351 43.5418 6.4529 24.7212 41.8608 16.2973 22.9364 0.2243 0.1243 0.4186 12.0772 1.3986 8.3863 0.4480 3.0075 0.9892 1.2038 0.9080 0.5357 0.4206 0.2838 22.6130 198.7484 7.4236 37.1026 15.7567 14.0580 18.7104 2.4727 11.6807 32.3205 32.8359 17.3497 15.1104 78.0818 11.6191 0.6493 0.0153 0.0626 0.7896 6.0740 0.6757 0.2268 8.7487 11.9637 3.0032 31.6338 6.4844 3.4539 2.2649 3.2355 1.5105 4.4318 15.8768 3.6128 3.4892 0.9170 0.4363 6.1165 18.8011 3.3139 2.5969 5.3816 15.9104 3.7444 12.6285 7.7334 27.2188 18.0346 1.8360 0.5998 11.9094 3.0967 187.6091 56.4664 46.1942 147.2626 30.2377 102.8283 15.9484 29.0695 21.2105 31.9172 40.7016 40.0225 26.2174 2.3929 0.6587 2.9092 5.6929 27.0368 20.1200 28.0714 34.4061 15.3217 7.8393 31.6647
temp: 298.150 k
press: 1.00000 atm
elementType: 8 8 8 7 6 6 6 6 6 6 6 6 6 6 6 6 6 6 6 6 6 6 6 6 1 1 1 1 1 1 1 1 1 1 1 1 1 1 1 1 1 1 1 1 1 1 1
symmnumber: 1
zpe: 1016576.0 jmol-1
zpe.correction: 0.387193 hartree
zpe.thermalcorrener: 0.408963 hartree
zpe.thermalcorrenthalpy: 0.409907 hartree
zpe.thermalcorrgfe: 0.334373 hartree
zpe.sumelectzpe: -1054.556066 hartree
zpe.sumelectthermal: -1054.534296 hartree
zpe.sumelectthermalent: -1054.533352 hartree
zpe.sumelectthermalfe: -1054.608887 hartree
dipole: 1.1703 -0.3932 -0.8664
dipole: 1.5083
quadrupole: -157.2341 -128.7187 -137.8147
quadrupole: -6.2861 -5.9747 -2.5203
quadrupole: -15.9783 12.5371 3.4412 -6.2861 -5.9747 -2.5203
hfenergy: -1054.9432595 hartree
pointgroup: C01 [X(C20H23N1O3)]
dipole: -0.441342 0.1613415 -0.3623564 debye
polarizability: 236.2438335|-3.840428|243.9080088|11.0722352|-18.0132577|191.9791406 unknown
InChI: InChI=1S/C20H23NO3/c22-19(23)20(17-7-3-1-4-8-17,18-9-5-2-6-10-18)11-12-21-13-15-24-16-14-21/h1-10,22H,11-16H2
charge 0 multiplicity 1
47 atoms
O  5.897913 0.442007 -0.126589
O  0.059086 1.721285 2.086192
O  -1.558501 0.206266 2.72699
N  3.033178 -0.052407 -0.199913
C  -0.816955 0.262163 0.330382
C  0.599158 0.480518 -0.292738
C  1.688097 -0.45503 0.274713
C  3.600221 1.095712 0.554326
C  4.009352 -1.171871 -0.225241
C  -1.232771 -1.213897 0.110467
C  -1.880856 1.223527 -0.291468
C  4.921753 1.544705 -0.08878
C  5.326032 -0.698126 -0.863515
C  -0.824798 0.66115 1.821942
C  -1.674245 -1.594452 -1.184095
C  -3.239406 1.069708 0.093408
C  -1.08741 -2.222118 1.095993
C  -1.546052 2.24643 -1.211003
C  -1.965992 -2.940931 -1.487411
C  -4.238122 1.914344 -0.432411
C  -1.383927 -3.571431 0.794852
C  -2.548479 3.09117 -1.742851
C  -1.822835 -3.939467 -0.496179
C  -3.897045 2.930656 -1.356282
H  0.902985 1.527369 -0.129034
H  0.534214 0.313381 -1.383147
H  1.638069 -0.469174 1.393468
H  1.497161 -1.488874 -0.06522
H  3.788332 0.819793 1.623298
H  2.882987 1.936354 0.547642
H  3.589191 -2.001793 -0.824302
H  4.223153 -1.560326 0.802726
H  4.72722 1.908168 -1.12101
H  5.403197 2.341709 0.502003
H  6.094801 -1.487752 -0.826628
H  5.139034 -0.404778 -1.919217
H  -1.800774 -0.827285 -1.956895
H  -3.508798 0.283549 0.807861
H  -0.768337 -1.961871 2.108639
H  -0.509122 2.394169 -1.525029
H  -2.308614 -3.209091 -2.493227
H  -5.280557 1.780027 -0.122848
H  -1.274137 -4.333674 1.574609
H  -2.271899 3.87433 -2.457817
H  -0.064896 2.002051 3.033499
H  -2.054228 -4.985599 -0.725907
H  -4.671976 3.587207 -1.767454
