program: Gaussian 09
title: 000222267
version: EM64L-G09RevD.01
frameworkgroup: C1[X(C12H19N)]
method: RPBEPBE
basis: SDD
operation: Freq
keyword: #pfreq=noraman
keyword: PBEPBE/SDD
title: #p freq=noraman PBEPBE/SDD
converged: YES YES NO NO
title: Mulliken charges:
elementType: N C C C C C C C C C C C C H H H H H H H H H H H H H H H H H H H
charge: -0.431356 -0.444651 -0.333215 -0.342900 -0.351196 0.457549 -0.693629 -0.364660 -0.431567 0.446098 -0.428813 -0.338878 -0.815190 0.203842 0.204042 0.189437 0.189355 0.207351 0.207266 0.194656 0.194709 0.291201 0.217618 0.210436 0.210465 0.235388 0.209046 0.219892 0.220772 0.223062 0.220103 0.223766
chargesum: 0.00000
title: Mulliken charges with hydrogens summed into heavy atoms:
elementType: N C C C C C C C C C C C C
charge: -0.140155 -0.036767 0.045577 0.071717 0.038169 0.457549 -0.055110 -0.129272 -0.222521 0.446098 -0.208921 -0.118105 -0.148259
polarizability: 2.09676987e+02 3.80446115e+00 1.29975780e+02 -1.65438424e-01 4.32688446e-02 8.40113359e+01
1716.lowfreq: 0.0003 0.0005 0.0008 5.3160 10.4790 15.2150 21.0763 30.4766 43.4434
frequency: 19.0040 30.4337 43.1576 56.3421 81.0750 105.2166 135.1950 156.7092 160.6365 219.1715 233.0828 277.5632 291.5587 322.4224 356.5541 411.9570 418.1978 477.5114 507.3618 546.8140 638.9906 709.9157 729.0971 754.1803 764.3837 808.1596 811.0371 834.8395 855.2940 894.2646 924.2663 949.5056 974.9005 981.4932 1001.9641 1017.5154 1044.3837 1055.3105 1078.6264 1098.3165 1119.6457 1144.2532 1154.6323 1190.8156 1207.4988 1224.1278 1244.3190 1260.4772 1283.4033 1289.6447 1292.6054 1313.8083 1324.2958 1353.1451 1364.9834 1374.6660 1393.4739 1397.2810 1419.6882 1463.1525 1466.1855 1468.9669 1469.9044 1478.3734 1478.9497 1485.1377 1487.3829 1502.6018 1528.7649 1584.6396 1639.7805 2917.3497 2951.2739 2957.3650 2961.6279 2966.0929 2971.1947 2974.0369 2995.9080 3014.9300 3038.9632 3039.9596 3070.4926 3073.2369 3074.0850 3099.0584 3113.5157 3125.7107 3151.5508 3572.3080
redmass: 1.1109 2.7921 1.7860 3.7485 3.3133 1.6768 2.5740 3.5120 3.2012 4.3778 1.1167 1.0888 2.9446 4.1275 2.8022 2.9442 3.6759 3.4134 2.3530 4.3466 6.8189 2.7490 1.0714 4.4123 1.1210 1.5886 1.3311 5.2662 1.1780 1.8941 1.3079 1.3551 1.1463 1.4697 2.6839 3.4493 1.5059 2.9348 2.4693 2.4283 1.5441 2.4036 1.5456 1.1038 1.4013 2.7261 1.3155 1.2025 1.5481 1.0574 1.1193 1.3355 1.6469 1.6511 2.4456 2.0091 1.2205 1.2397 3.6287 1.3955 1.0764 1.0806 1.0461 1.0684 1.0420 1.2585 1.0899 1.1126 3.0638 4.8446 6.5575 1.0567 1.1030 1.0588 1.0586 1.0372 1.0589 1.0365 1.0988 1.1031 1.1048 1.0978 1.1008 1.0993 1.0980 1.0864 1.0888 1.0964 1.0943 1.0769
irintensity: 0.2015 0.0129 1.5736 0.0526 3.9298 7.8355 3.1636 0.0458 1.1175 0.2341 0.2318 74.9192 2.5815 10.2414 0.0220 0.0044 0.1642 0.8688 22.1787 1.9453 0.0903 1.2139 12.0323 6.0151 0.4819 60.8179 17.2057 1.6871 0.0506 7.3642 0.3495 0.0959 1.0972 7.0234 0.9148 1.8574 10.0174 1.2737 0.0377 3.6926 13.2006 19.7361 0.0094 11.5499 0.0702 0.1794 3.4779 0.1086 20.4182 0.0046 1.1557 6.9105 35.9744 5.6573 25.6168 31.7169 13.2420 6.8075 7.0004 39.5394 0.5495 0.1986 11.4699 8.5223 12.7629 7.9333 14.2995 70.8628 260.3277 6.4506 142.8166 58.0349 31.6175 0.6620 5.9492 69.4855 111.4280 36.3720 1.6329 1.6452 81.6427 34.6922 90.6801 52.2682 22.4291 19.3845 31.0724 33.3047 18.0495 29.8905
temp: 298.150 k
press: 1.00000 atm
elementType: 7 6 6 6 6 6 6 6 6 6 6 6 6 1 1 1 1 1 1 1 1 1 1 1 1 1 1 1 1 1 1 1
symmnumber: 1
zpe: 737208.7 jmol-1
zpe.correction: 0.280788 hartree
zpe.thermalcorrener: 0.295935 hartree
zpe.thermalcorrenthalpy: 0.296879 hartree
zpe.thermalcorrgfe: 0.236114 hartree
zpe.sumelectzpe: -522.423431 hartree
zpe.sumelectthermal: -522.408284 hartree
zpe.sumelectthermalent: -522.407340 hartree
zpe.sumelectthermalfe: -522.468105 hartree
dipole: 2.2404 0.6259 -0.0001
dipole: 2.3262
quadrupole: -76.8678 -74.9220 -85.0193
quadrupole: 0.4676 -0.0348 0.0105
quadrupole: 2.0686 4.0144 -6.0829 0.4676 -0.0348 0.0105
hfenergy: -522.7042187 hartree
pointgroup: C01 [X(C12H19N1)]
dipole: -0.8809403 0.2478937 -0.0088051 debye
polarizability: 209.6609567|-3.9722397|129.9298329|-0.0307758|-1.68725|84.0733132 unknown
InChI: InChI=1S/C12H19N/c1-3-4-5-10-13-12-8-6-11(2)7-9-12/h6-9,13H,3-5,10H2,1-2H3
charge 0 multiplicity 1
32 atoms
N  -0.265597 0.770382 -0.030922
C  -2.731462 0.556055 -0.022899
C  -3.935482 -0.410526 0.009359
C  -1.377744 -0.180373 0.006239
C  -5.297586 0.31963 -0.021673
C  1.081075 0.400014 -0.018978
C  -6.498425 -0.649998 0.0102
C  1.486664 -0.965095 0.03153
C  2.100433 1.399903 -0.058146
C  3.875134 -0.316787 0.002065
C  2.858787 -1.301415 0.04105
C  3.460087 1.042382 -0.047554
C  5.3493 -0.687374 0.012003
H  -2.786838 1.181774 -0.937917
H  -2.790885 1.246329 0.844149
H  -3.879931 -1.03985 0.921794
H  -3.874837 -1.105334 -0.853879
H  -1.321044 -0.807806 0.923536
H  -1.321056 -0.876956 -0.859649
H  -5.35284 0.948959 -0.933366
H  -5.358343 1.014653 0.84059
H  -0.491013 1.763594 -0.066687
H  -7.45972 -0.104869 -0.014303
H  -6.476985 -1.336345 -0.857329
H  -6.484355 -1.269081 0.927107
H  0.737605 -1.762519 0.063863
H  1.814214 2.459471 -0.096994
H  3.14197 -2.361117 0.080468
H  4.218905 1.835253 -0.078331
H  5.879055 -0.232746 0.871321
H  5.487021 -1.781005 0.077726
H  5.863996 -0.341204 -0.905173
