program: Gaussian 09
title: 000222263
version: EM64L-G09RevD.01
frameworkgroup: C1[X(C15H16ClN5)]
method: RPBEPBE
basis: SDD
operation: Freq
keyword: #p
keyword: freq=noraman
keyword: PBEPBE/SDD
title: #p freq=noraman PBEPBE/SDD
converged: NO YES NO NO
title: Mulliken charges:
elementType: Cl N N N N N C C C C C C C C C C C C C C C H H H H H H H H H H H H H H H H
charge: -0.014771 -0.415171 -0.268367 -0.016965 -0.005116 0.021465 0.302226 -0.754603 -0.693512 -0.693668 0.259615 -0.015016 0.170128 -0.420128 0.412148 -0.367982 -0.352470 -0.400488 -0.228015 -0.203793 -0.245389 0.319246 0.219606 0.235638 0.219723 0.276304 0.207258 0.209847 0.207414 0.209783 0.276245 0.260064 0.316338 0.285401 0.229152 0.228368 0.229485
chargesum: 0.00000
title: Mulliken charges with hydrogens summed into heavy atoms:
elementType: Cl N N N N N C C C C C C C C C C C C C C C
charge: -0.014771 -0.095924 -0.268367 -0.016965 -0.005116 0.021465 0.302226 -0.079636 -0.000103 -0.000225 0.259615 -0.015016 0.170128 -0.160064 0.412148 -0.367982 -0.036132 -0.115087 0.001137 0.024575 -0.015904
polarizability: 3.40424910e+02 -1.05811896e+00 2.27486367e+02 -4.91397370e-02 1.34855388e-01 1.01643786e+02
1716.lowfreq: -2.6830 -0.0008 0.0013 0.0015 1.9882 4.4055 31.4408 41.1009 54.5398
frequency: 31.2738 40.9741 54.5259 78.7562 83.3550 111.4723 111.8401 174.6099 196.2578 196.9060 216.7147 220.7774 251.5552 270.0529 276.5225 277.3973 338.9166 339.5631 356.7275 360.0726 381.7316 407.3237 410.8873 452.3595 466.3596 501.5578 516.1124 540.2399 597.5539 615.9357 628.6530 659.0254 670.4759 674.4934 702.2659 730.4418 748.7127 771.8928 772.9639 780.7988 828.5302 861.0274 889.5930 899.9750 916.4165 925.0335 942.7404 957.5565 972.4755 987.7331 993.1361 1006.8057 1022.5789 1033.1993 1037.0073 1039.7741 1077.7554 1097.1158 1129.4999 1172.2661 1191.0753 1213.9750 1223.4113 1234.5938 1244.1624 1271.1597 1309.9021 1328.4121 1368.3385 1377.4877 1378.5582 1382.6372 1392.4128 1403.2068 1407.6453 1426.3423 1451.5319 1453.4122 1466.5454 1469.2082 1474.0140 1487.0838 1491.0544 1497.3473 1504.3814 1532.6088 1587.1149 1598.1114 1614.0544 2975.8959 2986.1810 2990.0831 3067.2920 3079.9665 3084.1119 3099.3913 3109.6482 3112.7505 3131.3666 3143.5862 3162.1418 3177.9007 3188.1181 3208.5059 3546.3948
redmass: 4.7744 3.8546 3.2134 4.6041 4.6607 8.1580 7.2542 4.0823 1.1210 4.5827 5.2347 3.2438 1.2946 1.0571 6.4083 2.6114 2.5220 5.1440 5.4356 7.5828 3.4897 5.2238 2.9678 2.3973 2.7058 1.4881 2.6993 6.8771 7.0243 6.5612 7.2350 9.3840 10.4302 7.3986 2.0913 8.0490 5.4408 5.8665 1.6864 3.6044 1.6440 1.2454 3.5523 5.8499 1.6867 1.6391 1.4040 1.2041 6.2807 6.2254 1.3469 1.3033 3.0287 1.5095 1.3921 2.9434 3.2500 1.6359 4.2147 1.0550 1.1453 1.9437 2.1941 3.0274 3.6240 4.6951 6.6477 1.3989 9.1117 1.2034 1.4559 3.4707 6.0872 1.2606 5.1808 2.3511 1.0454 2.3044 1.0821 1.2993 1.0475 1.0513 2.3476 2.1296 1.1416 5.7561 5.7655 6.9266 5.9528 1.0370 1.0359 1.0367 1.1004 1.1001 1.0994 1.0976 1.1000 1.0996 1.0854 1.0908 1.0967 1.0967 1.0955 1.0973 1.0769
irintensity: 0.7633 0.0583 0.0172 0.9108 0.2607 1.1632 0.4049 0.0043 0.0209 0.8511 3.7230 0.6290 0.3071 0.3632 4.1227 0.8235 0.2813 6.6889 0.4185 7.4768 1.4048 0.7929 0.0003 0.7044 3.5773 72.7213 0.6357 7.5546 0.9754 0.7868 2.7411 0.7362 12.8111 36.3381 37.1638 6.3492 8.3654 2.7538 51.4031 45.3752 12.8885 0.0009 45.9858 56.7849 0.3528 7.1328 10.2552 0.5342 49.7624 0.8557 0.2118 2.3991 2.2866 7.8787 0.0015 19.0239 10.3392 14.4671 108.6460 0.4870 19.2220 36.0952 187.0658 19.3237 38.5137 54.7539 117.4945 22.0659 364.1854 33.6422 36.4664 45.8868 51.3056 17.6520 32.3990 18.2294 0.5332 14.4029 3.3954 41.0568 0.4172 9.2821 178.4556 43.0842 40.1748 165.8902 879.4299 12.1457 7.5732 22.6779 33.8752 35.3901 24.2249 27.9774 35.6329 45.6683 1.3232 18.7946 0.2294 23.6529 23.6123 23.8488 5.4826 2.2098 59.4614
temp: 298.150 k
press: 1.00000 atm
elementType: 17 7 7 7 7 7 6 6 6 6 6 6 6 6 6 6 6 6 6 6 6 1 1 1 1 1 1 1 1 1 1 1 1 1 1 1 1
symmnumber: 1
zpe: 757543.6 jmol-1
zpe.correction: 0.288533 hartree
zpe.thermalcorrener: 0.307496 hartree
zpe.thermalcorrenthalpy: 0.308440 hartree
zpe.thermalcorrgfe: 0.240945 hartree
zpe.sumelectzpe: -1313.511103 hartree
zpe.sumelectthermal: -1313.492140 hartree
zpe.sumelectthermalent: -1313.491196 hartree
zpe.sumelectthermalfe: -1313.558691 hartree
dipole: 3.0948 -4.0924 0.0128
dipole: 5.1308
quadrupole: -105.7097 -130.0628 -134.6164
quadrupole: -12.1713 -0.0089 0.0330
quadrupole: 17.7532 -6.5998 -11.1534 -12.1713 -0.0089 0.0330
hfenergy: -1313.7996359 hartree
pointgroup: C01 [X(C15H16Cl1N5)]
dipole: -1.2500576 -1.5831131 -0.0770201 debye
polarizability: 340.4161056|-1.1827429|227.2015986|-1.1691995|6.0190397|101.937358 unknown
InChI: InChI=1S/C15H16ClN5/c1-15(2,3)20-12-11-9-17-21(10-7-5-4-6-8-10)13(11)19-14(16)18-12/h4-9,20H,1-3H3
charge 0 multiplicity 1
37 atoms
Cl -1.066528 3.738595 0.209239
N  -3.122588 -0.868687 -0.012349
N  1.590776 -0.689576 -0.020592
N  -2.040469 1.241531 0.088941
N  1.227074 -2.051361 -0.082551
N  0.39283 1.487569 0.088956
C  -4.540097 -0.369593 0.016308
C  -5.430352 -1.635132 -0.044991
C  -4.807064 0.404616 1.333093
C  -4.813516 0.531989 -1.215581
C  -1.972195 -0.131057 0.020823
C  -0.67518 -0.755211 -0.014875
C  0.457888 0.118037 0.021867
C  -0.127803 -2.076265 -0.081798
C  2.984898 -0.340296 -0.011973
C  -0.876657 1.927649 0.116667
C  3.385413 1.018139 0.046849
C  3.948691 -1.377738 -0.064015
C  4.762617 1.326226 0.052326
C  5.319188 -1.04814 -0.057272
C  5.735455 0.302569 0.000615
H  -3.005894 -1.88258 -0.061865
H  -5.249926 -2.296167 0.823932
H  -6.493294 -1.342021 -0.028476
H  -5.253613 -2.207446 -0.975465
H  -4.153518 1.288758 1.398094
H  -4.626515 -0.240595 2.211884
H  -5.859529 0.740238 1.358341
H  -4.63359 -0.021066 -2.155244
H  -5.86723 0.864556 -1.204378
H  -4.163405 1.42083 -1.194153
H  -0.627833 -3.042904 -0.126675
H  2.631674 1.80755 0.086393
H  3.613195 -2.416001 -0.108651
H  5.072062 2.376112 0.097509
H  6.063387 -1.851061 -0.097609
H  6.801849 0.552333 0.005376
