program: Gaussian 09
title: 000222262
version: EM64L-G09RevD.01
frameworkgroup: C1[X(C17H20ClN5O)]
method: RPBEPBE
basis: SDD
operation: Freq
keyword: #p
keyword: freq=noraman
keyword: PBEPBE/SDD
title: #p freq=noraman PBEPBE/SDD
converged: YES YES NO NO
title: Mulliken charges:
elementType: Cl O N N N N N C C C C C C C C C C C C C C C C C H H H H H H H H H H H H H H H H H H H H
charge: -0.012923 -0.280830 -0.351551 -0.268501 -0.002846 -0.005078 0.021959 -0.360763 -0.395084 -0.286051 -0.001407 0.236009 0.173362 0.047876 -0.418792 0.412529 -0.675689 -0.691273 -0.369470 -0.352270 -0.399788 -0.227279 -0.203605 -0.245053 0.207672 0.232179 0.218451 0.253287 0.179626 0.213656 0.312736 0.186484 0.262318 0.210731 0.214521 0.223312 0.200387 0.228397 0.223291 0.315517 0.285722 0.229400 0.228869 0.229966
chargesum: 0.00000
title: Mulliken charges with hydrogens summed into heavy atoms:
elementType: Cl O N N N N N C C C C C C C C C C C C C C C C C
charge: -0.012923 -0.280830 -0.038815 -0.268501 -0.002846 -0.005078 0.021959 0.079088 0.076653 0.107230 -0.001407 0.236009 0.173362 0.234361 -0.156475 0.412529 -0.027126 -0.039197 -0.369470 -0.036753 -0.114067 0.002121 0.025264 -0.015087
polarizability: 3.60478601e+02 9.33501805e+00 2.50701601e+02 3.97503408e+01 -5.83029108e+00 1.39162732e+02
1716.lowfreq: -4.0286 -1.0860 -0.0019 -0.0014 0.0013 4.6768 13.3368 16.2879 25.3393
frequency: 11.6952 15.6367 25.1504 37.5705 41.6280 55.0419 71.3126 97.1373 105.0999 111.3539 148.3952 157.2798 187.6916 199.5466 207.7675 218.8964 231.9570 242.8933 275.6727 289.5628 313.3704 345.9212 356.6198 364.3157 394.3226 409.8513 414.3115 421.3563 473.3753 497.6392 513.5910 520.1688 526.2651 604.6424 615.9196 628.1638 658.5976 668.9985 676.1393 701.7714 706.6252 747.3043 750.1342 772.6784 773.3300 780.4386 831.2916 859.3332 860.2887 887.3728 901.4415 918.7750 936.2712 942.1523 946.1329 987.6035 990.3563 992.5097 1005.6535 1017.1137 1028.1894 1038.6258 1041.3482 1049.1135 1092.6593 1096.8820 1105.1646 1126.0913 1139.7617 1161.7417 1172.4573 1179.8116 1191.6924 1214.3074 1232.0198 1264.8767 1273.1346 1284.9778 1306.1302 1311.2750 1326.7853 1328.7196 1335.6175 1367.5279 1369.6040 1370.6685 1379.4717 1382.8878 1393.2821 1394.0661 1409.2701 1411.7878 1449.9595 1454.9051 1458.2342 1461.3527 1467.1337 1472.0707 1480.9043 1485.0185 1490.8176 1495.7065 1531.5600 1597.4886 1600.2300 1613.8371 2947.1034 2954.0771 2981.8868 2990.3228 2998.9504 3008.0115 3033.5335 3062.5483 3075.0751 3085.7800 3086.3818 3092.4345 3097.6538 3131.7547 3144.0669 3162.4918 3179.7150 3188.3835 3211.1547 3573.5082
redmass: 5.6284 5.5533 2.9622 4.0259 3.7537 4.3337 3.5383 5.4141 2.4444 7.7552 5.7902 4.1642 1.0537 4.2071 5.8198 2.2497 1.4791 4.2810 3.4243 5.5493 3.2688 3.5937 6.7327 7.7565 4.5424 2.9593 3.3281 3.0180 2.3040 2.1871 3.5320 2.6288 3.9712 7.1813 6.7024 7.5143 9.1392 10.3332 5.8982 2.0813 4.3545 2.7533 3.7893 1.6982 1.4878 3.7878 1.5849 1.8696 1.2458 2.6552 3.0889 1.2159 1.3867 1.4055 5.6406 6.1910 6.9449 1.3507 1.3054 4.8100 3.8377 3.5139 2.7293 5.0741 1.8832 1.6538 1.9418 4.3402 2.1827 2.1646 1.0547 1.9661 1.1454 1.4707 1.9272 4.0998 1.2615 1.1245 1.2287 5.5530 1.3076 1.4161 1.3093 1.4138 1.7213 3.0638 1.2692 5.3356 1.2375 5.8286 4.6045 2.1293 1.9773 1.0518 1.2912 1.0636 1.0603 1.0601 1.0969 1.0490 2.5479 3.2473 6.7509 6.8669 5.7834 5.9351 1.0789 1.0682 1.0355 1.0357 1.0597 1.0622 1.0978 1.1011 1.0987 1.1020 1.1030 1.0997 1.1000 1.0855 1.0909 1.0968 1.0963 1.0956 1.0973 1.0776
irintensity: 0.8654 0.4373 0.6706 0.2408 0.1272 0.6053 0.9142 3.3429 0.4119 0.4479 0.7457 1.6271 0.0526 0.8480 3.2910 2.3865 0.9780 0.8165 1.5841 5.3744 0.8369 6.4007 1.9439 7.5978 2.3283 0.0211 7.9944 9.7265 16.3934 54.2739 8.6149 35.2839 8.8579 1.2382 1.0982 2.7297 1.5002 13.9647 48.5913 37.6091 2.4015 19.7802 1.3841 44.4607 9.1862 44.0932 15.6103 18.9725 0.0132 13.9442 52.2093 1.5669 0.7713 10.1664 45.9880 2.7587 45.5239 0.1685 2.2622 26.5298 37.1562 26.9008 16.4464 52.5338 4.7402 17.3182 58.9222 70.0234 33.5886 20.7095 0.1766 28.8706 9.2942 22.9409 45.5897 52.0330 5.4707 3.8220 37.7865 96.2640 19.8722 26.4691 13.8967 117.4530 109.9803 204.9210 23.6430 9.9104 31.0875 41.3092 32.6589 1.4558 40.2282 5.7641 12.7903 0.2914 0.6069 2.7542 15.8640 16.7187 161.5356 73.7943 159.0120 12.1919 826.7566 2.6968 52.2107 38.2860 23.7863 20.7270 11.5708 63.9653 14.7212 21.9341 32.2762 18.1591 17.1423 58.3533 44.7491 0.0765 23.1013 25.1846 20.9658 5.9455 2.1957 62.8001
temp: 298.150 k
press: 1.00000 atm
elementType: 17 8 7 7 7 7 7 6 6 6 6 6 6 6 6 6 6 6 6 6 6 6 6 6 1 1 1 1 1 1 1 1 1 1 1 1 1 1 1 1 1 1 1 1
symmnumber: 1
zpe: 916862.5 jmol-1
zpe.correction: 0.349214 hartree
zpe.thermalcorrener: 0.372190 hartree
zpe.thermalcorrenthalpy: 0.373134 hartree
zpe.thermalcorrgfe: 0.292723 hartree
zpe.sumelectzpe: -1467.079076 hartree
zpe.sumelectthermal: -1467.056100 hartree
zpe.sumelectthermalent: -1467.055156 hartree
zpe.sumelectthermalfe: -1467.135567 hartree
dipole: -1.0219 -3.1932 -0.1921
dipole: 3.3582
quadrupole: -146.3316 -139.2531 -151.4964
quadrupole: 1.0881 6.5648 7.1000
quadrupole: -0.6379 6.4406 -5.8027 1.0881 6.5648 7.1000
hfenergy: -1467.42829 hartree
pointgroup: C01 [X(C17H20Cl1N5O1)]
dipole: 0.3801768 0.770465 -1.0037265 debye
polarizability: 353.2363956|-33.7225105|197.9880153|-45.4780462|-52.5857249|199.1185226 unknown
InChI: InChI=1S/C17H20ClN5O/c1-12(2)24-10-6-9-19-15-14-11-20-23(13-7-4-3-5-8-13)16(14)22-17(18)21-15/h3-5,7-8,11-12,19H,6,9-10H2,1-2H3
charge 0 multiplicity 1
44 atoms
Cl 0.725351 -2.933507 1.343349
O  6.538813 0.531876 -0.479034
N  1.820723 0.474993 -2.1876
N  -2.533991 0.701861 -0.354439
N  -2.443949 1.732932 -1.313517
N  1.181908 -1.055504 -0.519376
N  -1.029779 -1.074662 0.521052
C  4.171665 0.550207 -1.278554
C  3.178598 -0.096472 -2.273012
C  5.570168 -0.094636 -1.38405
C  -0.44475 0.595174 -1.226933
C  0.865629 0.015357 -1.321347
C  -1.337306 -0.004387 -0.281032
C  6.495112 0.04265 0.925554
C  -1.192571 1.658169 -1.82711
C  -3.765692 0.528101 0.366189
C  7.216964 -1.312796 1.052508
C  7.159828 1.145946 1.757804
C  0.22581 -1.511206 0.320889
C  -3.891041 -0.491422 1.343005
C  -4.849673 1.394803 0.080638
C  -5.115192 -0.633382 2.031015
C  -6.063582 1.235727 0.779179
C  -6.20528 0.22331 1.757045
H  4.263628 1.635572 -1.474031
H  3.774014 0.425754 -0.254565
H  3.535787 0.029632 -3.312803
H  3.094934 -1.176666 -2.063957
H  5.498536 -1.189557 -1.204847
H  5.988986 0.058607 -2.396259
H  1.604605 1.304385 -2.740682
H  5.43384 -0.071476 1.23827
H  -0.904407 2.371834 -2.597682
H  7.17683 -1.67631 2.096227
H  6.753616 -2.084665 0.411536
H  8.275763 -1.206148 0.756638
H  7.192883 0.86403 2.825811
H  6.605976 2.094915 1.656988
H  8.19377 1.31121 1.405809
H  -3.047611 -1.152997 1.552129
H  -4.72674 2.172314 -0.676247
H  -5.212108 -1.421578 2.785636
H  -6.900984 1.90632 0.55733
H  -7.151077 0.104589 2.296475
