program: Gaussian 09
title: 000222258
version: EM64L-G09RevD.01
frameworkgroup: C1[X(C17H12ClN5)]
method: RPBEPBE
basis: SDD
operation: Freq
keyword: #p
keyword: freq=noraman
keyword: PBEPBE/SDD
title: #p freq=noraman PBEPBE/SDD
converged: YES YES NO NO
title: Mulliken charges:
elementType: Cl N N N N N C C C C C C C C C C C C C C C C C H H H H H H H H H H H H
charge: -0.005355 -0.268930 -0.441155 0.000254 0.031113 -0.026477 -0.028834 0.168506 0.239603 0.415209 -0.418358 0.459902 -0.351372 -0.399432 -0.355596 -0.227222 -0.203230 -0.455786 -0.327986 -0.243977 -0.197588 -0.218520 -0.251195 0.260330 0.318971 0.315149 0.285709 0.230316 0.229702 0.218268 0.324283 0.230799 0.229484 0.230876 0.232539
chargesum: 0.00000
title: Mulliken charges with hydrogens summed into heavy atoms:
elementType: Cl N N N N N C C C C C C C C C C C C C C C C C
charge: -0.005355 -0.268930 -0.122184 0.000254 0.031113 -0.026477 -0.028834 0.168506 0.239603 0.415209 -0.158027 0.459902 -0.036223 -0.113723 -0.355596 0.003093 0.026471 -0.237518 -0.003704 -0.013178 0.031896 0.012356 -0.018657
polarizability: 4.46122257e+02 1.91302268e+00 2.51536356e+02 1.12485283e-02 3.37227576e-02 8.32184663e+01
1716.lowfreq: -4.8061 -0.0012 0.0016 0.0029 3.3704 8.1469 27.0562 39.4264 43.3356
frequency: 26.9358 39.4001 43.2621 63.6914 72.1848 107.8717 111.4572 163.1446 186.4038 210.5636 214.0474 245.2334 269.8598 292.9396 349.3082 358.5968 365.5150 403.6865 408.9222 410.6120 505.1241 513.9567 530.8788 557.0600 610.4164 614.2636 616.1737 618.5396 629.5345 659.3506 674.9448 682.9820 697.1461 701.9390 734.3127 769.2929 770.0106 773.5795 781.0805 817.8103 826.7192 844.1242 860.8855 899.7319 922.6431 943.3505 964.1906 976.0459 985.1889 987.9146 993.4769 1006.8821 1008.4376 1019.8903 1026.3705 1040.6270 1058.9457 1088.9346 1097.7525 1133.2834 1172.8797 1173.6131 1190.9630 1191.7905 1220.0152 1238.0460 1265.5561 1308.2280 1321.7409 1329.2691 1363.2071 1374.0536 1386.5043 1393.7352 1407.7256 1427.5021 1441.4042 1453.8787 1485.9979 1490.7269 1514.0777 1530.7174 1578.8538 1598.4413 1609.3701 1613.0311 1616.1528 3107.5903 3132.4400 3135.7753 3144.7441 3147.8965 3163.0434 3168.1466 3180.1623 3188.6010 3197.1072 3208.2344 3534.8898
redmass: 6.2138 3.7700 4.3637 6.1451 6.3449 9.3673 7.4607 6.1419 6.6238 8.3522 6.2611 4.3454 5.5410 6.1547 8.6633 6.8283 12.8139 8.0309 2.9335 2.9623 2.7167 3.3346 7.4567 8.0846 6.8029 1.8907 6.5769 7.0357 3.4719 8.9190 4.4843 8.0139 2.0132 2.0892 8.9277 1.7169 9.2447 1.6917 3.3227 5.9577 1.6645 1.2780 1.2450 9.0644 1.4128 1.4031 6.9864 1.3487 6.1857 6.2249 1.3498 1.3044 1.3072 3.3703 2.2759 3.1491 3.3680 1.6383 1.6400 3.8911 1.0553 1.0558 1.1133 1.1458 2.1700 2.6357 3.9106 7.1788 1.4817 1.3865 10.7482 3.9257 8.9498 6.9671 5.1941 3.0416 2.7600 2.5290 2.3002 2.6802 3.3889 7.0999 5.6586 6.9207 4.2650 5.9170 4.4694 1.0890 1.0855 1.0868 1.0909 1.0933 1.0968 1.0999 1.0964 1.0956 1.0954 1.0972 1.0756
irintensity: 0.1534 0.0461 0.0099 0.1837 0.5217 1.6564 0.4262 0.3553 0.6778 1.1815 1.1671 5.0547 2.8639 0.8075 2.9656 0.0027 8.7609 0.6042 0.0047 0.0013 30.7101 2.3679 4.2042 11.8093 1.4745 21.1437 3.5495 3.9438 0.1454 1.9814 16.8722 55.4427 46.8257 37.2961 8.7658 78.6789 6.0724 40.8855 74.8634 6.1138 15.3035 0.7159 0.0015 73.5207 11.7340 10.4752 81.4280 0.1131 1.5601 0.8129 0.1617 2.1964 2.7945 5.9960 7.7084 14.7961 16.1749 31.4531 20.5934 99.5612 0.5503 0.4180 2.9629 16.7561 7.8943 26.5753 83.8853 129.8633 1.6723 12.3080 353.1477 13.5123 8.6559 33.4363 86.5539 14.8428 12.5945 31.0763 167.9486 300.7486 23.4183 419.6890 736.4273 10.4257 276.8021 1.1484 62.7857 14.9142 0.2219 0.0340 22.4802 25.3722 26.0935 28.8965 23.1124 6.1479 17.0797 1.9535 36.1729
temp: 298.150 k
press: 1.00000 atm
elementType: 17 7 7 7 7 7 6 6 6 6 6 6 6 6 6 6 6 6 6 6 6 6 6 1 1 1 1 1 1 1 1 1 1 1 1
symmnumber: 1
zpe: 677645.8 jmol-1
zpe.correction: 0.258102 hartree
zpe.thermalcorrener: 0.275936 hartree
zpe.thermalcorrenthalpy: 0.276881 hartree
zpe.thermalcorrgfe: 0.210399 hartree
zpe.sumelectzpe: -1387.258569 hartree
zpe.sumelectthermal: -1387.240734 hartree
zpe.sumelectthermalent: -1387.239790 hartree
zpe.sumelectthermalfe: -1387.306272 hartree
dipole: -1.6942 -3.8246 0.0007
dipole: 4.1831
quadrupole: -114.4824 -132.3933 -146.9587
quadrupole: 8.4689 0.0079 0.0138
quadrupole: 16.7958 -1.1152 -15.6806 8.4689 0.0079 0.0138
hfenergy: -1387.5166709 hartree
pointgroup: C01 [X(C17H12Cl1N5)]
dipole: 0.6765016 1.500275 0.0055102 debye
polarizability: 446.1351414|0.623221|251.5190155|1.1927111|0.3044161|83.2229223 unknown
InChI: InChI=1S/C17H12ClN5/c18-17-21-15(20-12-7-3-1-4-8-12)14-11-19-23(16(14)22-17)13-9-5-2-6-10-13/h1-11,20H
charge 0 multiplicity 1
35 atoms
Cl 0.379056 -3.754524 -0.004323
N  -2.246685 0.695768 -0.003757
N  2.458983 0.862707 0.012479
N  -1.873082 2.055202 0.000543
N  -1.06415 -1.491398 -0.004092
N  1.369274 -1.262489 0.004969
C  0.02022 0.745187 0.004025
C  -1.120533 -0.120485 -0.001579
C  1.307862 0.105987 0.007159
C  -3.644385 0.3566 -0.008495
C  -0.518217 2.072193 0.005087
C  3.834906 0.484397 0.016695
C  -4.054681 -0.999966 -0.01317
C  -4.599409 1.403024 -0.008353
C  0.200162 -1.944675 -0.000085
C  -5.434238 -1.297499 -0.01767
C  -5.972485 1.083919 -0.012854
C  4.779276 1.548213 0.020126
C  4.289276 -0.860962 0.017909
C  -6.398951 -0.264853 -0.017565
C  6.160641 1.273356 0.024782
C  5.677428 -1.117615 0.022592
C  6.620056 -0.064532 0.026075
H  -0.013061 3.037273 0.008771
H  2.302895 1.873224 0.013386
H  -3.308202 -1.797004 -0.012992
H  -4.256682 2.439865 -0.004712
H  -5.751728 -2.34589 -0.021412
H  -6.710496 1.893448 -0.012583
H  4.432494 2.590461 0.019011
H  3.561336 -1.672634 0.014896
H  -7.467234 -0.506286 -0.021128
H  6.876012 2.102794 0.027282
H  6.021288 -2.157829 0.023556
H  7.693554 -0.279978 0.029827
