program: Gaussian 09
title: 000222253
version: EM64L-G09RevD.01
frameworkgroup: C1[X(C14H14ClN5)]
method: RPBEPBE
basis: SDD
operation: Freq
keyword: #p
keyword: freq=noraman
keyword: PBEPBE/SDD
title: #p freq=noraman PBEPBE/SDD
converged: NO YES NO NO
title: Mulliken charges:
elementType: Cl N N N N N C C C C C C C C C C C C C C H H H H H H H H H H H H H H
charge: -0.011942 -0.446073 -0.172828 -0.008151 -0.034132 0.045672 -0.028440 0.276561 0.253795 0.171684 0.275022 0.468503 -0.563166 -0.314337 -0.420160 -0.419044 -0.859555 -0.609986 -0.812566 -0.341664 0.342274 0.233250 0.324089 0.258201 0.234079 0.231313 0.227935 0.251405 0.248931 0.248912 0.264489 0.222979 0.235796 0.227154
chargesum: 0.00000
title: Mulliken charges with hydrogens summed into heavy atoms:
elementType: Cl N N N N N C C C C C C C C C C C C C C
charge: -0.011942 -0.103799 -0.172828 -0.008151 -0.034132 0.045672 -0.028440 0.276561 0.253795 0.171684 0.275022 0.468503 -0.329916 0.009752 -0.161959 -0.184965 -0.148901 0.152346 -0.126637 -0.341664
polarizability: 3.45377371e+02 -1.36618778e+01 2.30835101e+02 -6.03478743e-01 3.36547567e-01 8.87235700e+01
1716.lowfreq: 0.0015 0.0018 0.0023 2.0637 6.2227 7.4228 20.1996 28.9846 40.8704
frequency: 19.9243 28.7076 40.7737 67.5515 85.2866 89.7326 118.2898 163.0633 166.1254 185.0118 187.2442 203.1450 220.2590 223.2379 260.7674 285.9343 333.6551 338.6130 364.8227 366.6637 438.5477 448.3144 484.8618 515.5394 538.5483 554.5357 563.8080 613.0155 617.5587 658.9467 667.6207 677.3476 711.5906 736.2636 749.1680 771.0909 780.1723 809.6804 821.2482 850.0701 887.4178 897.0039 929.3337 958.7294 977.0675 995.7753 1014.2519 1026.8468 1043.1596 1048.3830 1111.4541 1125.8781 1129.3954 1171.0833 1187.4482 1218.2114 1223.1060 1249.1713 1283.1880 1295.7164 1306.7789 1354.5523 1368.2703 1379.5483 1396.1870 1397.4588 1414.5411 1421.2072 1440.3054 1450.4258 1467.5693 1467.8697 1472.9067 1474.3501 1485.1915 1490.2280 1501.8442 1519.9524 1546.5281 1574.9496 1609.6486 1628.5125 2950.4576 2972.0481 3008.3440 3018.5025 3052.4999 3082.6514 3087.3427 3102.3583 3113.8523 3128.7334 3131.2212 3191.0547 3209.8223 3540.9675
redmass: 1.0277 4.2388 4.0822 6.1354 3.8229 1.1399 5.3786 3.6716 5.5480 4.9651 1.8799 2.8092 3.9666 1.7949 6.1443 2.7015 5.3427 5.9735 16.2979 4.6735 3.0942 3.0298 5.7044 6.4633 4.9987 2.5190 6.0785 1.9489 4.3312 9.1842 4.0062 6.8516 5.6533 3.5703 8.0602 7.1378 3.2628 5.9097 1.7621 1.3173 1.3006 7.3290 3.6456 2.8158 1.4955 1.3165 1.5433 4.6266 1.5143 1.5677 2.7780 2.7005 1.3118 1.5204 2.1878 2.3823 1.8970 4.6878 5.7785 1.4323 7.7896 4.4879 9.7318 5.0916 1.2583 1.2280 3.0292 1.6429 3.6236 1.8822 1.0445 1.5075 1.0588 1.1342 1.0462 1.3732 1.6735 3.2965 6.8466 6.0822 3.1227 5.9488 1.0403 1.0388 1.0330 1.0979 1.0948 1.0996 1.0942 1.1027 1.0912 1.1019 1.0912 1.0945 1.0973 1.0751
irintensity: 0.5053 0.1156 0.1841 0.3570 0.4402 0.0021 0.0287 5.0374 2.3537 1.8522 3.4489 0.0080 1.7181 1.7716 7.5880 0.1777 4.3993 0.0982 8.1437 0.1035 1.7416 7.1213 3.1069 6.9504 0.9714 18.9572 17.7117 22.2675 1.9053 0.1304 17.1750 24.3204 2.6266 4.1167 25.5205 4.1520 27.3688 14.8718 12.1733 48.2577 0.6112 70.6892 16.7978 24.5141 4.5808 4.7510 2.1020 24.4553 1.8471 22.8188 60.9078 27.8373 0.9833 11.0867 78.4884 14.6866 2.4765 45.5564 15.0893 0.6524 204.0090 30.4006 162.1520 26.9214 11.5306 1.9432 22.7905 5.7291 22.6502 106.6803 17.0145 17.4359 11.4593 7.4948 15.3243 5.9946 254.1950 34.8650 451.7258 523.1560 256.0383 37.0486 30.0392 49.0625 49.4437 21.7822 23.7692 16.3411 16.9372 16.1946 28.8695 3.2563 17.0298 13.6442 2.4002 58.7992
temp: 298.150 k
press: 1.00000 atm
elementType: 17 7 7 7 7 7 6 6 6 6 6 6 6 6 6 6 6 6 6 6 1 1 1 1 1 1 1 1 1 1 1 1 1 1
symmnumber: 1
zpe: 683594.3 jmol-1
zpe.correction: 0.260367 hartree
zpe.thermalcorrener: 0.278852 hartree
zpe.thermalcorrenthalpy: 0.279797 hartree
zpe.thermalcorrgfe: 0.211642 hartree
zpe.sumelectzpe: -1274.292514 hartree
zpe.sumelectthermal: -1274.274029 hartree
zpe.sumelectthermalent: -1274.273085 hartree
zpe.sumelectthermalfe: -1274.341239 hartree
dipole: -2.0185 -4.0676 0.0718
dipole: 4.5415
quadrupole: -104.2918 -125.5010 -127.4086
quadrupole: 0.6332 -0.2865 0.2510
quadrupole: 14.7754 -6.4339 -8.3415 0.6332 -0.2865 0.2510
hfenergy: -1274.5528813 hartree
pointgroup: C01 [X(C14H14Cl1N5)]
dipole: 0.7164031 1.6142946 0.2707089 debye
polarizability: 346.3609066|-8.6101371|227.0350799|2.7271707|19.5315428|91.540056 unknown
InChI: InChI=1S/C14H14ClN5/c1-8-4-5-11(9(2)6-8)17-12-10-7-16-20(3)13(10)19-14(15)18-12/h4-7,17H,1-3H3
charge 0 multiplicity 1
34 atoms
Cl -1.719691 -3.766748 -0.61509
N  0.525116 0.72621 0.079541
N  -4.173437 0.710393 0.028729
N  -3.787941 2.041777 0.232711
N  -0.645613 -1.335913 -0.240735
N  -3.087146 -1.475995 -0.287951
C  -1.91506 0.703304 0.051108
C  1.88952 0.308151 0.038672
C  -0.651065 0.019628 -0.038881
C  -3.077545 -0.120406 -0.083811
C  2.88053 1.331998 0.181263
C  4.65926 -0.387148 -0.021921
C  4.241477 0.957758 0.145439
C  2.283744 -1.042847 -0.135281
C  -2.424314 2.028524 0.248818
C  3.65334 -1.373673 -0.164891
C  2.491724 2.791875 0.360367
C  -5.586102 0.341677 -0.040676
C  6.13276 -0.753606 -0.024497
C  -1.83878 -1.969637 -0.349749
H  0.395381 1.729496 0.222808
H  5.001526 1.742672 0.251287
H  1.514986 -1.80795 -0.249301
H  -1.899562 2.971386 0.398416
H  3.940293 -2.42301 -0.302963
H  1.919976 3.184428 -0.50545
H  1.885025 2.958208 1.274475
H  3.390576 3.422026 0.459928
H  -6.095123 0.604557 0.901202
H  -6.076896 0.867881 -0.875885
H  -5.641385 -0.745961 -0.202269
H  6.752432 0.056024 -0.449908
H  6.500655 -0.942329 1.003308
H  6.318934 -1.67005 -0.611612
