program: Gaussian 09
title: 000222238
version: EM64L-G09RevD.01
frameworkgroup: C1[X(C12H10ClN5)]
method: RPBEPBE
basis: SDD
operation: Freq
keyword: #p
keyword: freq=noraman
keyword: PBEPBE/SDD
title: #p freq=noraman PBEPBE/SDD
converged: NO YES NO NO
title: Mulliken charges:
elementType: Cl N N N N N C C C C C C C C C C C C H H H H H H H H H H
charge: -0.006987 -0.385369 -0.388274 0.000352 0.056368 0.001496 -0.464291 0.020062 0.238180 0.378558 0.130207 -0.408339 -0.386980 -0.385059 -0.349774 -0.222861 -0.222869 -0.231137 0.249753 0.250778 0.333720 0.263738 0.241215 0.241665 0.347776 0.231941 0.231947 0.234185
chargesum: 0.00000
title: Mulliken charges with hydrogens summed into heavy atoms:
elementType: Cl N N N N N C C C C C C C C C C C C
charge: -0.006987 -0.051649 -0.040498 0.000352 0.056368 0.001496 0.036240 0.020062 0.238180 0.378558 0.130207 -0.144601 -0.145765 -0.143393 -0.349774 0.009080 0.009078 0.003048
polarizability: 2.41574036e+02 1.16785536e+01 1.74446436e+02 -4.33422448e-01 3.54455706e-01 1.11832778e+02
1716.lowfreq: -17.9520 -3.7446 0.0007 0.0019 0.0019 4.4618 7.7527 24.5332 45.2280
frequency: -17.4755 23.9501 45.2197 86.7450 106.2727 114.8281 202.2547 203.0370 232.6477 262.2286 315.5638 324.0968 341.0483 366.2858 401.7259 474.5929 482.9365 512.7862 535.7284 582.0326 609.6164 616.8038 652.8935 661.1882 665.8378 700.2142 709.5748 747.3686 763.0674 784.2468 828.4139 833.3875 857.4274 900.9430 918.5605 933.2835 942.2225 980.0565 990.1307 1000.2910 1005.6957 1025.7884 1033.9475 1087.6697 1118.9056 1154.0494 1174.6594 1188.0048 1208.6501 1218.6037 1221.4392 1275.5881 1319.8138 1325.0219 1338.3647 1366.4148 1375.9307 1382.5204 1391.1914 1434.6070 1439.5826 1481.8224 1486.4945 1487.1947 1557.6819 1593.0974 1594.1682 1615.3666 3004.5244 3054.2761 3121.1568 3121.6031 3136.0152 3148.9212 3165.5387 3216.1245 3567.5780 3617.2217
redmass: 4.1602 4.1644 6.5838 4.8148 8.5520 7.4423 5.0298 5.8311 7.6683 9.1455 2.2014 4.6754 8.7238 15.2651 2.7895 1.1727 4.0268 9.4033 5.5669 4.7069 3.5448 6.3414 2.2973 5.3290 3.1147 4.0130 2.4388 7.1699 1.9751 3.8798 4.3413 1.6131 1.2440 6.0071 2.3535 2.2053 1.6242 1.3883 6.2862 1.4673 4.2678 2.2006 4.9688 1.5277 3.8597 7.6221 1.0547 1.1180 1.1094 1.9832 2.0633 3.2482 1.6525 1.2738 2.4029 9.7983 3.9788 8.3394 3.5329 1.9891 2.1678 1.5709 3.5900 1.4641 6.5466 6.0533 7.1930 6.1531 1.0593 1.1040 1.0864 1.0886 1.0912 1.0960 1.1016 1.0977 1.0782 1.0826
irintensity: 0.5350 0.0653 0.1890 0.8255 0.2634 0.7086 0.8493 0.4785 0.9014 0.7127 3.1998 8.2808 2.6698 7.3262 0.3325 64.2445 15.3480 3.6454 12.0675 6.4349 18.2627 0.1112 46.8228 25.0995 37.0336 30.2975 20.2744 23.9498 43.8449 24.2177 10.2680 18.3528 0.3917 73.1200 35.8771 47.5046 1.9715 0.0498 1.3005 2.5445 12.9202 7.6025 7.1775 8.1163 30.2755 132.1670 0.0173 1.4592 0.4650 2.2753 6.0751 182.9435 11.0666 0.3908 84.3774 185.5279 42.5914 0.1669 53.7404 16.0983 8.8628 42.6947 16.6011 0.1872 344.9292 2.7161 712.5253 7.9106 18.8713 10.0187 7.7073 2.9111 10.1977 33.5242 21.1609 2.2749 83.1724 110.9715
temp: 298.150 k
press: 1.00000 atm
elementType: 17 7 7 7 7 7 6 6 6 6 6 6 6 6 6 6 6 6 1 1 1 1 1 1 1 1 1 1
symmnumber: 1
zpe: 542893.7 jmol-1
zpe.correction: 0.206777 hartree
zpe.thermalcorrener: 0.220580 hartree
zpe.thermalcorrenthalpy: 0.221524 hartree
zpe.thermalcorrgfe: 0.164247 hartree
zpe.sumelectzpe: -1195.832507 hartree
zpe.sumelectthermal: -1195.818704 hartree
zpe.sumelectthermalent: -1195.817760 hartree
zpe.sumelectthermalfe: -1195.875037 hartree
dipole: 4.9321 2.5810 -0.0185
dipole: 5.5666
quadrupole: -102.1351 -122.6129 -106.0242
quadrupole: -3.6037 -0.0568 0.1180
quadrupole: 8.1223 -12.3555 4.2332 -3.6037 -0.0568 0.1180
hfenergy: -1196.0392838 hartree
pointgroup: C01 [X(C12H10Cl1N5)]
dipole: -1.8445851 -1.180455 0.0212476 debye
polarizability: 239.0382064|17.3289226|176.9378517|-0.1130449|-1.7558807|111.8771927 unknown
InChI: InChI=1S/C12H10ClN5/c13-12-16-10(9-7-15-18-11(9)17-12)14-6-8-4-2-1-3-5-8/h1-5,7,14,18H,6H2
charge 0 multiplicity 1
28 atoms
Cl 3.225596 3.419915 -0.076253
N  -0.402587 -0.051499 -0.016117
N  4.024202 -1.664557 0.024929
N  1.39283 1.458489 -0.041436
N  3.744152 0.783621 -0.023394
N  3.225166 -2.81303 0.045876
C  -1.38935 1.056685 -0.040028
C  1.908759 -0.913084 0.0057
C  0.948282 0.157561 -0.017196
C  -2.801021 0.494354 -0.015882
C  3.28016 -0.503547 0.00061
C  1.94416 -2.34721 0.034007
C  -3.481686 0.202713 -1.225965
C  -3.45149 0.231593 1.217393
C  2.731521 1.670151 -0.042444
C  -4.785088 -0.343472 -1.205298
C  -4.75467 -0.314753 1.241993
C  -5.423845 -0.604666 0.029656
H  -1.215331 1.668929 -0.943663
H  -1.202605 1.716079 0.826993
H  -0.758102 -1.008291 -0.000669
H  1.130598 -3.071068 0.04661
H  -2.991314 0.412423 -2.184837
H  -2.937647 0.464209 2.158537
H  5.037992 -1.757301 0.028871
H  -5.30209 -0.559038 -2.14698
H  -5.248127 -0.507686 2.201059
H  -6.436168 -1.02382 0.047128
