program: Gaussian 09
title: 000222232
version: EM64L-G09RevD.01
frameworkgroup: C1[X(C6H6N4S)]
method: RPBEPBE
basis: SDD
operation: Freq
keyword: #pfreq=noraman
keyword: PBEPBE/SDD
title: #p freq=noraman PBEPBE/SDD
converged: NO YES NO NO
title: Mulliken charges:
elementType: S N N N N C C C C C C H H H H H H
charge: 0.306163 -0.357029 -0.016012 -0.048176 0.022837 0.136169 0.188201 -0.364609 -0.599747 -0.467071 -0.379943 0.341311 0.252528 0.212682 0.252557 0.272566 0.247572
chargesum: 0.00000
title: Mulliken charges with hydrogens summed into heavy atoms:
elementType: S N N N N C C C C C C
charge: 0.306163 -0.015718 -0.016012 -0.048176 0.022837 0.136169 0.188201 -0.364609 0.118020 -0.194505 -0.132371
polarizability: 1.56641221e+02 3.22162693e+00 1.19926572e+02 -4.84927904e-03 2.80514805e-02 4.62944930e+01
1716.lowfreq: -46.0997 -1.2353 0.0019 0.0025 0.0030 8.5373 14.3779 91.5899 159.9744
frequency: -45.8235 91.5755 159.9724 163.2518 204.4938 283.2724 321.3588 382.5487 468.4133 489.1316 536.0520 574.5334 602.9450 631.1584 632.3627 691.8166 728.9618 761.5569 801.8833 827.4673 895.8521 931.6478 1074.6706 1081.8574 1123.0285 1163.8545 1198.9080 1239.9599 1302.4996 1307.1908 1362.7695 1413.1117 1424.8460 1441.6070 1455.4357 1456.2475 1493.6013 1519.4109 1600.8677 2993.1424 3074.1816 3112.8652 3167.0807 3220.0251 3558.7696
redmass: 1.0245 5.0425 3.7545 4.0605 9.9226 5.1093 4.4583 12.8382 3.8912 8.3284 10.5461 1.1991 5.4249 8.4916 7.5614 5.9155 7.8112 1.7541 3.0868 7.6141 5.8464 1.4475 2.7704 3.5772 1.2839 2.5966 3.2760 1.4503 8.3682 6.3992 1.4940 1.7684 2.4486 2.3376 2.5879 1.0407 1.1325 4.6756 5.1154 1.0341 1.1013 1.1015 1.0922 1.0960 1.0778
irintensity: 0.0784 3.8338 3.1746 0.7015 0.2587 0.2135 3.0963 5.1730 2.4924 4.2176 3.6153 101.7815 0.5140 20.5406 17.4585 2.8731 34.8623 44.5457 2.2270 10.6958 32.7632 9.6775 23.5552 12.7585 1.5457 1.2211 0.8297 4.4690 159.5091 65.5074 3.5072 12.8230 52.8098 7.8784 17.2494 14.0758 3.4642 90.2324 578.3514 62.3485 26.1069 20.5408 16.0844 0.6664 64.3391
temp: 298.150 k
press: 1.00000 atm
elementType: 16 7 7 7 7 6 6 6 6 6 6 1 1 1 1 1 1
symmnumber: 1
zpe: 316808.1 jmol-1
zpe.correction: 0.120666 hartree
zpe.thermalcorrener: 0.129273 hartree
zpe.thermalcorrenthalpy: 0.130217 hartree
zpe.thermalcorrgfe: 0.086519 hartree
zpe.sumelectzpe: -848.517316 hartree
zpe.sumelectthermal: -848.508708 hartree
zpe.sumelectthermalent: -848.507764 hartree
zpe.sumelectthermalfe: -848.551463 hartree
dipole: 1.5985 -3.1951 0.0049
dipole: 3.5726
quadrupole: -61.8773 -70.4527 -72.7945
quadrupole: 0.7498 0.0020 0.0078
quadrupole: 6.4975 -2.0779 -4.4197 0.7498 0.0020 0.0078
hfenergy: -848.6379817 hartree
pointgroup: C01 [X(C6H6N4S1)]
dipole: -0.6218262 -1.2605552 -0.0016156 debye
dipolederiv: -0.3380988 0.1124611 0.0013042 -0.0630854 -0.3083473 0.0008485 0.0032824 0.0002833 0.1257962 -1.1000393 -0.3707513 -0.0000101 -0.8624686 -0.6718006 -0.0000123 -0.0006845 -0.0000524 -0.4594383 -0.6279189 -0.3031674 0.0019588 -0.1969129 -0.3532486 0.0001098 -0.0007921 -0.0002995 -0.1662731 -0.5847219 -0.0060283 0.0004853 -0.7397944 -0.8076066 0.0004303 -0.0004894 -0.0004103 -0.2236428 -0.9337572 0.2513011 0.0006764 0.34522 -0.845 -0.0014813 0.0002347 0.0000146 -0.1779603 -0.5752077 -0.2826382 0.0001762 -0.0084944 -0.1407895 0.0005243 0.0018835 -0.000722 0.0441091 1.1886672 0.5424558 0.0004165 1.0287309 0.9373908 -0.000025 0.0000999 -0.0000482 0.2191283 0.7172031 -0.34801 -0.0020733 -0.4319345 0.6567678 0.0022265 -0.0018779 0.0013099 -0.0350518 0.6604249 0.0496363 -0.0002353 -0.0531361 0.1909163 0.0001237 -0.0001753 0.0001792 0.2299867 0.3328719 0.4554424 -0.0021649 0.4920867 0.514588 -0.0029397 -0.0035176 0.0003437 -0.1739609 1.0509775 -0.090572 -0.0008738 0.2789888 0.6203339 -0.0000516 0.0005054 -0.0005893 -0.0435827 0.1260239 0.0303423 0.0000907 0.0929931 0.2403346 -0.000039 0.0003641 -0.0000163 0.3311228 -0.0203391 -0.0205039 0.0172107 0.1044547 0.062064 -0.0964943 0.0906663 -0.0685606 -0.0566473 -0.0020639 -0.058264 -0.0000177 -0.156816 -0.1022017 -0.0001884 -0.0000632 -0.0002019 0.1260222 -0.020184 -0.0203637 -0.0171852 0.104625 0.0617994 0.0965881 -0.0904475 0.0687559 -0.0562042 0.0596909 0.003733 0.000179 0.0261124 0.0134936 0.0004528 0.0013611 -0.0007669 0.1893682 0.0664717 0.0549267 0.0000628 0.0394306 -0.068694 -0.0000724 -0.00035 0.0007807 0.1272279 unknown
polarizability: 156.6761413|-3.0155852|119.8916035|-0.0759711|-0.0212071|46.2945416 unknown
InChI: InChI=1S/C6H6N4S/c1-7-5-4-6(9-2-8-5)11-3-10-4/h2-3,7H,1H3
charge 0 multiplicity 1
17 atoms
S  2.946104 -0.003895 -0.00522
N  -2.012908 -1.10045 -0.000132
N  0.880245 -1.737244 -0.000212
N  -1.450809 1.204233 0.000868
N  0.88904 1.951521 0.000263
C  0.332056 -0.447054 -0.000386
C  -1.066333 -0.116274 -0.000102
C  1.2417 0.640971 -0.00017
C  -3.454277 -0.824519 0.000558
C  2.199666 -1.680772 0.00216
C  -0.464609 2.148601 0.001906
H  -1.668046 -2.062188 -0.000592
H  -3.744718 -0.240728 0.891833
H  -3.999164 -1.782321 -0.000216
H  -3.745152 -0.239017 -0.889443
H  2.853964 -2.552479 0.002294
H  -0.79836 3.190516 0.00049
