program: Gaussian 09
title: 000222228
version: EM64L-G09RevD.01
frameworkgroup: C1[X(C9H9ClO2S)]
method: RPBEPBE
basis: SDD
operation: Freq
keyword: #p
keyword: freq=noraman
keyword: PBEPBE/SDD
title: #p freq=noraman PBEPBE/SDD
converged: YES YES NO NO
title: Mulliken charges:
elementType: Cl S O O C C C C C C C C C H H H H H H H H H
charge: -0.057010 0.013004 -0.406384 -0.236860 0.418896 0.319043 -0.789543 -0.355023 -0.385442 -0.833363 -0.241782 -0.099652 0.273472 0.334393 0.287465 0.261461 0.238627 0.251742 0.235446 0.258849 0.127484 0.385178
chargesum: 0.00000
title: Mulliken charges with hydrogens summed into heavy atoms:
elementType: Cl S O O C C C C C C C C C
charge: -0.057010 0.140489 -0.021206 -0.236860 0.418896 0.319043 -0.455149 -0.067558 -0.123982 -0.107548 0.017067 -0.099652 0.273472
polarizability: 1.77741709e+02 8.37513036e+00 1.24071372e+02 7.66466551e-01 -8.92902779e+00 8.91378203e+01
1716.lowfreq: -6.0226 0.0017 0.0020 0.0022 2.1263 5.8122 38.1830 44.5984 65.6459
frequency: 38.1566 44.5811 65.6436 132.9319 146.2121 167.1209 171.8757 198.0605 217.1092 231.8002 272.3025 300.4854 349.8840 404.0683 448.7326 450.5315 521.6874 542.3815 572.0050 597.4889 648.1257 660.2583 701.1563 730.3160 794.0559 833.4483 850.8240 876.4232 893.9059 920.2607 977.0406 996.9159 1045.5506 1052.8998 1092.4287 1111.0759 1185.1753 1212.9155 1236.7861 1245.7097 1287.8035 1347.6163 1382.0099 1394.6632 1400.3115 1471.5386 1475.5447 1483.4005 1575.1729 1601.7238 1656.1444 2438.4420 2973.2197 3049.6770 3091.6853 3102.4108 3152.9219 3156.8181 3175.1666 3507.8047
redmass: 7.7736 5.1407 11.7033 8.4091 3.8200 2.8188 1.6470 2.2252 1.4039 4.4424 5.0241 8.6075 5.8730 5.8147 3.9210 3.2058 5.0829 4.0626 2.4732 4.1236 1.9194 3.3971 3.6503 3.1299 4.5735 1.4774 4.0582 1.3776 2.0834 3.3716 1.3488 1.5472 1.5583 2.4334 1.9263 2.2804 1.5986 1.2652 2.3065 1.5307 1.3214 2.8931 3.3108 2.8917 1.2852 1.2775 1.5846 1.2158 7.1921 6.5424 8.1459 1.0382 1.0386 1.0972 1.0976 1.0849 1.0894 1.0925 1.0967 1.0639
irintensity: 1.6771 0.4394 1.2524 0.2138 1.1509 0.4297 2.3432 1.2250 27.1476 1.1331 0.4440 0.8982 0.6282 22.5835 16.7848 1.4079 0.9871 1.6042 32.7538 45.4112 135.4375 18.3325 42.5271 3.4652 3.8639 34.8037 43.6601 16.3396 33.6910 26.5685 0.4513 1.9868 21.5259 304.5032 7.8849 6.3396 4.3000 11.4992 14.0494 0.3397 2.2182 51.4456 30.6508 1.7937 14.6002 25.3886 35.0290 47.2485 22.3571 31.2829 165.2155 10.0361 19.9812 12.0731 17.8408 1.4297 0.9540 3.2770 3.0189 36.3609
temp: 298.150 k
press: 1.00000 atm
elementType: 17 16 8 8 6 6 6 6 6 6 6 6 6 1 1 1 1 1 1 1 1 1
symmnumber: 1
zpe: 410692.4 jmol-1
zpe.correction: 0.156424 hartree
zpe.thermalcorrener: 0.169908 hartree
zpe.thermalcorrenthalpy: 0.170852 hartree
zpe.thermalcorrgfe: 0.114991 hartree
zpe.sumelectzpe: -1355.976025 hartree
zpe.sumelectthermal: -1355.962541 hartree
zpe.sumelectthermalent: -1355.961597 hartree
zpe.sumelectthermalfe: -1356.017458 hartree
dipole: 1.3823 0.7694 -1.2321
dipole: 2.0052
quadrupole: -95.9397 -87.3583 -88.8274
quadrupole: -4.0273 -4.8243 -1.3103
quadrupole: -5.2313 3.3502 1.8811 -4.0273 -4.8243 -1.3103
hfenergy: -1356.1324493 hartree
pointgroup: C01 [X(C9H9Cl1O2S1)]
dipole: -0.4772695 -0.5061949 -0.3719833 debye
dipolederiv: -0.9073342 -0.2083448 0.001185 -0.1888316 -0.1823259 0.0027201 -0.0271817 -0.0040308 -0.073994 -0.4393161 0.0741013 -0.0170476 0.0998217 0.0623479 0.0058368 0.2370822 0.1087607 -0.2739021 -0.714512 -0.2843881 -0.3877669 -0.2747638 -0.4003473 -0.25058 -0.4413306 -0.2851908 -0.8586141 -0.5777603 0.1780415 -0.1598626 -0.0195243 -0.8872867 -0.0544258 -0.2247849 -0.0002597 -0.4829768 0.0336375 0.0129891 0.0057304 0.0212024 -0.1782395 0.0353233 -0.1580724 0.0016997 -0.13643 0.0901391 0.15823 0.0020503 -0.0324631 0.3311319 0.0036311 -0.0149749 -0.0022823 -0.0099959 0.3547927 0.0982565 -0.2256254 0.1087581 -0.0554733 0.1385677 -0.3155652 -0.0171352 0.2239199 0.0190905 -0.0101738 0.0200628 0.1140865 0.012431 -0.0170196 0.0235079 -0.0027304 -0.1189032 -0.3271894 -0.247501 0.0019502 -0.1728958 -0.1873947 0.0101827 0.0024984 -0.0082597 -0.122078 -0.0033259 -0.1175863 0.0175602 -0.0452667 -0.1393795 0.0084239 0.032506 -0.0071927 0.0336285 -0.4385712 0.0002367 0.008648 0.0314216 -0.0058128 -0.007103 -0.0079727 -0.0049965 -0.1160787 1.2894994 0.2920331 0.0241457 0.2435295 0.2728758 0.0013596 0.0420899 -0.0022196 -0.0450312 0.8639461 -0.0522474 0.7570701 0.0529654 1.1208144 0.132523 0.8732709 0.1800872 0.9705205 0.0726539 -0.0181324 0.0230458 -0.0409317 0.0171591 -0.020515 0.0283575 -0.0242399 0.0377967 0.1180378 0.0616745 0.0092005 0.0471439 0.055279 0.0039008 0.0016156 0.0030589 0.1409934 0.0233682 0.0638482 -0.004698 0.0786158 0.0114326 0.0068223 -0.0067931 0.0107609 0.1571091 -0.071506 0.1672966 -0.0240736 0.051939 0.0196742 0.0105406 -0.0206238 0.0183254 0.111742 0.0344297 -0.0640118 0.093959 -0.0425503 0.0575907 -0.0021855 0.0874855 0.0498994 -0.0028364 0.0498785 -0.0603614 -0.1048938 -0.0361404 0.0204123 -0.0165779 -0.0989977 -0.0648594 -0.0422755 0.0720385 -0.0432962 0.0004371 -0.0488922 -0.0267747 0.0066745 -0.0038833 0.0049246 0.1658714 0.1281254 -0.0928719 0.0199395 -0.0802311 -0.0799157 -0.0510345 0.0224463 0.0229217 0.0700231 0.329878 0.0922076 -0.0610169 0.133007 0.1618013 0.0529346 -0.0306799 0.0229586 0.3715116 unknown
polarizability: 175.3054891|13.6658493|128.3832557|-0.5904628|-3.8157649|87.2621566 unknown
InChI: InChI=1S/C9H9ClO2S/c1-5-4-6(10)2-3-7(5)8(13)9(11)12/h2-4,8,11,13H,1H3
charge 0 multiplicity 1
22 atoms
Cl 4.32562 0.940063 0.184968
S  -2.357635 -0.799739 1.812512
O  -3.323427 -0.316503 -1.65406
O  -2.716761 1.608949 -0.510685
C  -0.172188 -0.184824 0.047127
C  0.817471 -1.216818 0.125484
C  -1.638412 -0.57202 0.028775
C  0.233522 1.17472 0.019312
C  2.185031 -0.851145 0.165641
C  0.440229 -2.686281 0.18516
C  1.597753 1.533227 0.05954
C  2.554116 0.506015 0.130958
C  -2.573852 0.380013 -0.700457
H  -1.780459 -1.574141 -0.39986
H  -0.523582 1.962683 -0.035774
H  2.955263 -1.62618 0.225592
H  1.333791 -3.317129 0.322084
H  -0.249922 -2.887999 1.02574
H  -0.06196 -3.021108 -0.74302
H  1.903285 2.582786 0.035497
H  -2.054619 0.489773 2.218734
H  -3.957363 0.311158 -2.097965
