program: Gaussian 09
title: 000222227
version: EM64L-G09RevD.01
frameworkgroup: C1[X(C15H7ClO4)]
method: RPBEPBE
basis: SDD
operation: Freq
keyword: #p
keyword: freq=noraman
keyword: PBEPBE/SDD
title: #p freq=noraman PBEPBE/SDD
converged: YES YES NO NO
title: Mulliken charges:
elementType: Cl O O O O C C C C C C C C C C C C C C C H H H H H H H
charge: 0.084869 -0.163730 -0.188864 -0.434692 -0.198904 0.357143 0.261204 0.251201 0.280354 -0.153006 -0.209414 -0.527149 -0.396331 0.400900 -0.364950 -0.364176 -0.331605 -0.223633 -0.225562 0.091606 0.301917 0.294457 0.291028 0.288866 0.243731 0.243989 0.390752
chargesum: 0.00000
title: Mulliken charges with hydrogens summed into heavy atoms:
elementType: Cl O O O O C C C C C C C C C C C C C C C
charge: 0.084869 -0.163730 -0.188864 -0.043939 -0.198904 0.357143 0.261204 0.251201 0.280354 -0.153006 -0.209414 -0.527149 -0.094413 0.400900 -0.070493 -0.073148 -0.042739 0.020098 0.018427 0.091606
polarizability: 3.07082743e+02 -2.36305099e+00 2.12033968e+02 -1.04508757e+00 -1.57621937e+00 7.00755125e+01
1716.lowfreq: -0.0011 -0.0010 0.0015 6.0710 7.8579 11.7156 20.4685 36.9195 43.3188
frequency: 20.3774 36.9143 43.3188 76.9144 117.6264 144.2930 164.8252 213.9490 230.5351 249.9931 258.6634 273.8188 318.1039 353.1625 381.2167 416.1154 417.1339 424.0857 464.1001 482.6302 495.7155 512.4105 552.0293 599.2529 602.9933 639.2084 665.4201 670.9711 704.8048 713.4088 730.6416 742.4678 770.6449 808.4684 829.9835 858.2741 896.4686 929.9261 938.0950 948.1770 1000.3580 1013.9439 1018.0926 1030.3662 1043.3895 1089.5450 1110.9003 1160.3667 1168.5021 1176.6487 1193.2542 1230.7056 1270.0282 1303.0771 1309.9420 1360.3360 1362.8020 1403.8144 1435.1051 1445.8386 1471.7421 1530.0903 1547.2333 1561.2112 1593.9923 1598.9614 1614.7643 1657.0501 3139.9902 3154.6733 3166.0087 3166.6178 3174.8461 3188.7927 3524.6478
redmass: 10.0481 9.2346 16.8196 6.7767 4.8479 8.0813 6.7057 11.8394 6.5269 6.5238 8.1195 9.0405 10.0049 11.3832 10.6240 4.2418 5.6292 5.4241 9.4861 4.3185 7.5713 5.7347 5.2121 5.0877 1.4167 6.9211 4.1389 6.0703 6.8169 4.3201 2.6470 7.4807 5.1942 1.7538 7.4671 2.7411 1.5322 7.6736 1.9373 7.9378 1.3901 1.4164 1.3710 2.5849 2.4851 2.5954 3.7195 1.6437 1.4571 1.4130 2.0341 1.9482 2.1846 2.1282 3.8429 8.0195 6.6274 10.4720 2.7131 2.9262 2.6662 9.1626 10.2701 7.3247 6.9524 8.2070 7.5745 9.4712 1.0866 1.0904 1.0944 1.0901 1.1002 1.0962 1.0642
irintensity: 2.6576 2.3134 0.6765 3.0364 0.1415 1.7530 0.3049 0.0716 2.8127 0.1755 0.7358 0.0356 1.1661 0.0618 13.3340 4.2043 8.1242 3.8082 5.9675 7.0732 28.4027 3.5706 18.6171 31.3440 91.1862 8.9069 35.6245 6.7721 6.2160 51.3461 44.1258 16.5312 9.4726 26.9114 13.4597 9.3969 33.4981 53.7058 1.9227 28.3713 4.5029 19.5293 0.4677 169.1901 252.2764 20.2328 35.9519 43.3906 22.4331 2.0122 8.3827 36.8900 231.3283 252.7270 146.8453 21.3487 3.7047 2.7973 11.2192 32.7196 7.4750 79.9803 134.3634 55.5288 21.0598 7.6378 15.6996 247.7014 3.6760 5.0528 1.9084 1.7874 27.3796 0.1409 55.9013
temp: 298.150 k
press: 1.00000 atm
elementType: 17 8 8 8 8 6 6 6 6 6 6 6 6 6 6 6 6 6 6 6 1 1 1 1 1 1 1
symmnumber: 1
zpe: 472015.2 jmol-1
zpe.correction: 0.179781 hartree
zpe.thermalcorrener: 0.195550 hartree
zpe.thermalcorrenthalpy: 0.196495 hartree
zpe.thermalcorrgfe: 0.134700 hartree
zpe.sumelectzpe: -1335.412143 hartree
zpe.sumelectthermal: -1335.396374 hartree
zpe.sumelectthermalent: -1335.395430 hartree
zpe.sumelectthermalfe: -1335.457224 hartree
dipole: 1.8211 2.1503 -0.6407
dipole: 2.8898
quadrupole: -89.8674 -128.9824 -122.4173
quadrupole: -16.9794 2.8715 2.3355
quadrupole: 23.8883 -15.2267 -8.6616 -16.9794 2.8715 2.3355
hfenergy: -1335.5919242 hartree
pointgroup: C01 [X(C15H7Cl1O4)]
dipole: -0.679883 0.8809621 0.2329656 debye
polarizability: 307.0615181|-2.1230468|212.0397399|2.960973|0.3111455|70.0909658 unknown
InChI: InChI=1S/C15H7ClO4/c16-12-10(15(19)20)6-5-9-11(12)14(18)8-4-2-1-3-7(8)13(9)17/h1-6,19H
charge 0 multiplicity 1
27 atoms
Cl 2.216486 -2.510929 0.249911
O  -0.609043 -2.59204 -0.005991
O  -1.478433 2.848547 -0.080913
O  5.057923 0.837502 0.595482
O  4.796678 -1.202342 -0.475236
C  0.395751 -0.365304 0.036222
C  0.11716 1.042014 -0.006741
C  -2.153863 -0.769001 0.008845
C  -2.410745 0.629229 -0.021924
C  -0.761533 -1.334149 0.016505
C  -1.283908 1.592565 -0.042178
C  1.766477 -0.771285 0.08431
C  1.163207 1.989758 -0.001249
C  2.821719 0.187594 0.060405
C  -3.244242 -1.674544 0.023646
C  -3.744374 1.11016 -0.036902
C  2.497708 1.568765 0.031929
C  -4.568217 -1.192987 0.011638
C  -4.820669 0.203103 -0.018896
C  4.275225 -0.181765 0.018536
H  0.896401 3.049835 -0.02566
H  -3.025297 -2.746357 0.043411
H  -3.904422 2.192457 -0.062888
H  3.316071 2.292227 0.037868
H  -5.405479 -1.898718 0.02525
H  -5.851228 0.572965 -0.029192
H  6.016649 0.5820 0.518311
