program: Gaussian 09
title: 000222222
version: EM64L-G09RevD.01
frameworkgroup: C1[X(C6H14N2O2)]
method: RPBEPBE
basis: SDD
operation: Freq
keyword: #p
keyword: freq=noraman
keyword: PBEPBE/SDD
title: #p freq=noraman PBEPBE/SDD
converged: YES YES NO NO
title: Mulliken charges:
elementType: O O N N C C C C C C H H H H H H H H H H H H H H
charge: -0.410187 -0.259837 -0.311957 -0.590203 -0.018978 -0.150680 -0.377107 -0.742912 -0.708456 0.144202 0.220525 0.270822 0.196585 0.207016 0.216014 0.240734 0.213198 0.212067 0.219749 0.215720 0.254843 0.295519 0.289749 0.373573
chargesum: 0.00000
title: Mulliken charges with hydrogens summed into heavy atoms:
elementType: O O N N C C C C C C
charge: -0.036614 -0.259837 -0.057114 -0.004935 0.201548 0.120142 0.026495 -0.072966 -0.060919 0.144202
polarizability: 9.47712068e+01 -2.36585689e+00 8.53701729e+01 -3.09933873e+00 7.51472968e-01 7.84303629e+01
1716.lowfreq: -6.0079 -0.0009 -0.0007 -0.0003 13.0532 17.8632 44.1083 63.0285 79.1331
frequency: 43.6977 62.7700 79.0289 116.2310 145.6214 176.3525 204.2737 228.2559 235.9911 275.3714 327.3849 342.0295 400.4755 425.1341 475.5245 497.7606 579.2786 609.4513 632.3753 697.9104 732.2413 761.7534 794.1261 861.3435 945.4662 969.7269 990.2196 1035.9979 1046.1009 1079.0214 1096.8121 1148.5486 1171.9692 1175.5606 1225.7127 1235.7463 1255.0499 1272.3478 1277.8201 1330.5807 1341.7206 1358.8128 1386.7062 1395.4599 1461.0568 1472.3901 1476.1461 1480.2588 1486.9902 1489.5374 1622.9595 1653.6380 2965.3818 2977.3574 2979.7476 2985.2789 3017.0665 3053.7516 3071.3524 3074.8005 3079.7494 3088.3926 3351.7215 3414.0814 3490.8167 3588.9135
redmass: 4.4300 1.8588 5.0457 3.2389 4.5973 2.0582 1.0439 2.2101 1.8607 2.7945 3.6493 2.8951 1.2647 2.8047 3.3459 2.5988 1.3317 2.5912 1.7835 2.7225 1.7734 1.4047 2.3104 2.4311 1.5837 1.2505 1.9023 2.7051 2.9449 2.6137 1.7277 2.8002 3.0040 2.2258 1.4096 1.3052 1.4677 1.2880 1.2440 1.3788 1.5039 1.5511 1.2179 1.1983 1.0799 1.0444 1.0752 1.0557 1.0671 1.0597 1.7933 2.0650 1.0608 1.0364 1.0815 1.0370 1.1002 1.0849 1.0997 1.0992 1.0990 1.0995 1.0734 1.0462 1.0638 1.0976
irintensity: 0.2882 0.1112 0.3997 6.2082 0.2390 1.9138 0.1846 14.0942 0.4822 6.0728 3.4591 1.2069 71.2458 7.1887 8.2782 8.5990 149.5785 54.4623 88.7099 84.4378 92.6610 1.4474 17.6599 9.6118 7.3267 3.6630 8.2939 221.7220 1.7858 9.6982 5.4920 2.0406 14.3257 0.3531 5.3955 3.8628 6.4311 6.0610 3.4310 5.2100 4.3840 3.4785 11.9069 17.4124 1.7192 13.1597 9.8432 4.4657 12.1405 12.0184 164.0214 59.5491 30.6051 29.9306 16.4800 29.6156 24.1335 6.4485 34.5517 61.3554 38.5008 32.2917 11.0013 4.8102 13.3799 3.4696
temp: 298.150 k
press: 1.00000 atm
elementType: 8 8 7 7 6 6 6 6 6 6 1 1 1 1 1 1 1 1 1 1 1 1 1 1
symmnumber: 1
zpe: 536675.6 jmol-1
zpe.correction: 0.204409 hartree
zpe.thermalcorrener: 0.216841 hartree
zpe.thermalcorrenthalpy: 0.217786 hartree
zpe.thermalcorrgfe: 0.165887 hartree
zpe.sumelectzpe: -496.124784 hartree
zpe.sumelectthermal: -496.112351 hartree
zpe.sumelectthermalent: -496.111407 hartree
zpe.sumelectthermalfe: -496.163305 hartree
dipole: -0.6458 -0.0372 -0.4350
dipole: 0.7795
quadrupole: -59.7587 -55.2200 -65.8100
quadrupole: -1.4794 -0.0939 -0.7280
quadrupole: 0.5042 5.0429 -5.5471 -1.4794 -0.0939 -0.7280
hfenergy: -496.3291926 hartree
pointgroup: C01 [X(C6H14N2O2)]
dipole: 0.2047383 0.1158788 0.1967614 debye
dipolederiv: -0.4779061 0.3305712 -0.2078796 0.2290907 -1.0050573 0.3122547 -0.1818589 0.2387422 -0.38101 -0.5527565 -0.024562 0.2675741 0.1030252 -0.5898016 0.1235019 0.2132213 0.2949891 -0.7814046 -0.2247245 0.1868168 0.2811922 0.2682728 -0.2875316 -0.0496531 0.1198254 -0.1745428 -0.0967491 -0.2553133 0.018028 -0.2772828 0.0581509 -0.3558897 0.1891558 -0.134243 0.2647182 -0.353333 0.1995004 0.0315608 -0.0315271 0.0813452 0.0520713 -0.0419014 0.0297847 -0.0276341 0.1173941 -0.0207686 -0.0668265 0.0229586 -0.06633 0.4361673 0.0574576 0.0202215 -0.0646418 0.0719713 0.0361276 -0.0480772 -0.0021556 -0.0273816 0.1200369 0.0261648 -0.0207515 0.0022533 0.028409 0.0168591 -0.0478952 0.001793 -0.0338168 -0.0335395 0.056628 -0.0317557 0.0490141 -0.0014509 -0.0369326 -0.0305023 -0.0317173 -0.0449168 0.0774818 -0.0137487 -0.0617714 -0.0164887 0.0456792 0.7250595 -0.3402358 -0.2515412 -0.4652832 1.0101238 -0.4045006 -0.2758641 -0.5283427 0.8915388 -0.0561146 0.1031432 0.0703472 0.0874011 -0.0368227 -0.0338398 0.020249 -0.0294972 0.013532 0.043752 0.0338183 -0.0511288 0.0320106 0.0386858 0.0134386 -0.0459261 0.0224754 -0.0685882 0.0251885 -0.0671125 0.029366 -0.0844658 -0.1030276 0.1160455 0.0454377 0.1120501 -0.0234604 -0.0559953 0.0967681 0.0364357 0.1007613 -0.0623241 -0.0870883 0.0192721 -0.0406052 0.0305451 0.0841915 -0.0004446 -0.0765289 -0.0062605 0.0637627 -0.0568966 -0.048123 -0.0069778 -0.1668594 0.0346978 0.1175931 0.0273662 0.0825543 -0.0159215 -0.026384 0.0643583 -0.0657375 0.0529491 -0.1481281 -0.1219245 0.0126885 -0.1047317 0.0202249 0.0022622 -0.0116961 -0.001969 0.108314 -0.0127695 0.0723965 0.0293611 0.1251936 -0.0623113 -0.0656388 0.0804294 -0.083063 0.0580178 0.0305213 -0.0192508 -0.0597009 -0.0143299 0.0936959 -0.0251552 -0.1140862 -0.0379311 -0.1720341 0.0400868 -0.0442035 0.0242453 -0.0811574 -0.09306 0.0941134 0.0703964 0.1182654 0.0462876 0.1217781 -0.1201849 -0.09118 -0.0964666 0.1791194 -0.0172391 -0.1716693 0.0585009 -0.0217157 0.1523604 -0.0089377 0.0646317 -0.0598613 0.0330025 -0.1044786 0.0785719 -0.0188586 0.3046162 0.0833166 -0.1237298 0.0857416 -0.1026675 0.2168586 -0.0661435 0.1579027 -0.0337205 0.1058217 0.2479694 0.0731912 0.1269411 0.0198635 0.304056 0.0016453 0.1780749 -0.0309986 0.1915293 unknown
polarizability: 91.0929836|5.4423082|89.3300424|-0.8286416|-1.855383|78.1487166 unknown
InChI: InChI=1S/C6H14N2O2/c1-3-4(2)5(8-7)6(9)10/h4-5,8-9H,3,7H2,1-2H3
charge 0 multiplicity 1
24 atoms
O  -1.820236 1.368558 -0.480736
O  -1.832662 -0.286973 1.141623
N  -0.210707 -1.960641 -0.490542
N  -1.463036 -2.628662 -0.683412
C  1.117625 0.150308 -0.627671
C  -0.290302 -0.518394 -0.795426
C  1.502603 0.379533 0.862556
C  1.231352 1.445286 -1.464563
C  3.007557 0.656102 1.071766
C  -1.366528 0.161807 0.06732
H  1.8146 -0.602128 -1.052244
H  -0.605296 -0.418974 -1.847937
H  1.218352 -0.504307 1.469218
H  0.911053 1.226922 1.265396
H  1.022124 1.245921 -2.531761
H  0.51233 2.209221 -1.119415
H  2.248688 1.869771 -1.398413
H  3.620434 -0.176285 0.677067
H  3.24315 0.769482 2.145641
H  3.328499 1.582017 0.561722
H  0.190675 -2.119083 0.449611
H  -1.346018 -3.548667 -1.110378
H  -2.117731 -2.58916 0.108795
H  -2.52593 1.751146 0.110384
