program: Gaussian 09
title: 000222209
version: EM64L-G09RevD.01
frameworkgroup: C1[X(C13H16O6)]
method: RPBEPBE
basis: SDD
operation: Freq
keyword: #pfreq=noraman
keyword: PBEPBE/SDD
title: #p freq=noraman PBEPBE/SDD
converged: YES YES NO NO
title: Mulliken charges:
elementType: O O O O O O C C C C C C C C C C C C C H H H H H H H H H H H H H H H H
charge: -0.247733 -0.264256 -0.228490 -0.195664 -0.201279 -0.251760 0.025410 0.011006 0.246576 0.232618 0.118563 -0.760900 -0.765698 0.119294 0.126041 -0.256630 -0.249407 -0.668201 -0.667460 0.249543 0.253375 0.262949 0.246656 0.283379 0.251527 0.243518 0.227770 0.234175 0.235592 0.219585 0.224428 0.251823 0.229807 0.219590 0.244253
chargesum: 0.00000
title: Mulliken charges with hydrogens summed into heavy atoms:
elementType: O O O O O O C C C C C C C C C C C C C
charge: -0.247733 -0.264256 -0.228490 -0.195664 -0.201279 -0.251760 0.025410 0.011006 0.246576 0.232618 0.118563 0.004967 0.015863 0.119294 0.126041 0.214658 0.220361 0.027634 0.026190
polarizability: 2.09389148e+02 2.30415631e+00 1.79286833e+02 2.05529352e+00 2.09455464e+00 1.09030873e+02
1716.lowfreq: -3.2119 -0.0006 0.0010 0.0010 3.3156 6.4060 19.3741 31.3719 47.4787
frequency: 19.3660 31.3442 47.4765 50.9580 61.2390 67.8454 69.9920 77.0841 85.4855 93.1101 132.5031 151.2225 159.7453 186.9409 212.7911 217.0677 230.5570 261.4110 267.8603 303.8108 308.1959 315.9373 367.4800 386.1119 420.0221 443.5696 462.3852 526.4785 531.5817 554.0618 586.5176 594.5795 642.8325 669.6437 728.9054 735.0079 766.2651 798.5426 810.8022 816.5102 822.3574 859.2863 889.2650 984.3669 998.4599 1016.7981 1045.4802 1048.2919 1050.8991 1052.1257 1092.3228 1094.0231 1095.3469 1120.5468 1156.0164 1157.6836 1182.5503 1212.1781 1276.7379 1278.1789 1296.2436 1335.5921 1357.2625 1359.5150 1389.2627 1389.4390 1401.8690 1406.5292 1447.8997 1449.9030 1458.0933 1458.2303 1462.5300 1462.8977 1465.0418 1468.8113 1484.7339 1484.8488 1555.6177 1595.5873 1605.3988 1629.1717 1662.8766 2991.2520 2992.9370 2996.6900 2998.5992 3034.4449 3034.6143 3075.7546 3076.3103 3084.8072 3088.2568 3094.0274 3095.8462 3121.3187 3123.5479 3142.2625 3142.7898
redmass: 4.5671 4.1777 3.1530 3.9314 2.9968 1.1599 3.1172 3.9317 1.2979 2.8219 5.0404 3.5166 3.2787 3.2558 2.1114 1.3072 2.5421 5.3411 3.5343 3.5897 2.7935 3.1150 5.3494 4.8326 3.8780 4.4954 5.2908 8.7040 4.6289 5.1058 4.9263 5.2393 6.4775 10.7027 3.7507 3.5344 5.3697 2.2456 1.8780 2.0852 2.4920 4.4020 2.3508 4.1484 2.5825 3.5076 2.7549 1.6118 1.7009 2.1096 2.6011 2.3875 2.4095 7.5042 1.6696 1.6871 5.6834 5.2716 1.1287 1.1151 5.1431 3.9105 1.3413 1.5510 1.2347 1.2366 1.2486 1.2589 1.0842 1.0618 1.0920 1.0966 1.0586 1.0447 1.0516 1.0563 1.0521 1.0523 11.9186 7.4867 9.5187 9.2955 9.5924 1.0359 1.0360 1.0392 1.0390 1.0599 1.0597 1.0968 1.0976 1.0976 1.0972 1.1021 1.1024 1.1071 1.1069 1.0973 1.0980
irintensity: 1.6296 2.2512 1.0614 2.7190 1.5278 0.0365 1.8361 1.0971 0.0468 0.1165 0.7810 0.5988 1.1617 2.2339 2.6196 1.8374 2.0881 2.3465 2.2269 1.5486 19.0342 15.0519 0.3565 1.8388 5.1769 8.2679 1.9171 0.4648 2.0259 0.4142 1.6053 1.6553 17.1974 11.4271 17.5592 10.1680 2.5970 19.2341 5.7817 1.8680 3.5522 10.0654 5.9639 100.1444 2.1812 313.7165 75.6370 21.0593 39.1852 49.7517 29.0740 13.2621 46.1986 207.8864 23.1704 17.7352 102.6658 127.7797 11.0992 3.5271 7.0383 365.3184 1.6476 99.4786 19.7102 20.2124 59.5496 41.0747 9.1655 20.3782 15.1374 15.8593 17.0933 12.2388 7.9451 18.5282 14.4349 12.7181 103.8533 28.5416 196.9205 64.5261 327.4372 18.4331 20.7370 7.6020 9.4523 15.3315 32.4152 4.6572 8.4990 36.5400 36.7389 4.9744 3.0574 26.9955 26.4061 3.9279 0.5207
temp: 298.150 k
press: 1.00000 atm
elementType: 8 8 8 8 8 8 6 6 6 6 6 6 6 6 6 6 6 6 6 1 1 1 1 1 1 1 1 1 1 1 1 1 1 1 1
symmnumber: 1
zpe: 707872.1 jmol-1
zpe.correction: 0.269614 hartree
zpe.thermalcorrener: 0.290808 hartree
zpe.thermalcorrenthalpy: 0.291752 hartree
zpe.thermalcorrgfe: 0.216825 hartree
zpe.sumelectzpe: -954.879451 hartree
zpe.sumelectthermal: -954.858257 hartree
zpe.sumelectthermalent: -954.857313 hartree
zpe.sumelectthermalfe: -954.932240 hartree
dipole: 1.6777 3.8792 1.4095
dipole: 4.4553
quadrupole: -82.9738 -106.1376 -115.9000
quadrupole: 5.5464 -8.7224 4.3110
quadrupole: 18.6966 -4.4671 -14.2295 5.5464 -8.7224 4.3110
hfenergy: -955.1490653 hartree
pointgroup: C01 [X(C13H16O6)]
dipole: 0.6894637 1.5246966 0.5219874 debye
polarizability: 208.1123986|3.6421008|179.2159076|-10.7383035|4.0907343|110.3785475 unknown
InChI: InChI=1S/C13H16O6/c1-5-17-12(15)9-7(3)19-8(4)10(11(9)14)13(16)18-6-2/h5-6H2,1-4H3
charge 0 multiplicity 1
35 atoms
O  0.131131 2.139818 0.041465
O  3.262047 -0.524896 -1.362931
O  -2.776158 -1.497702 0.437322
O  -0.239308 -1.855098 -0.922392
O  2.586829 -1.864058 0.430488
O  -3.652528 0.111197 -1.005212
C  1.181701 -0.007597 -0.295449
C  -1.312129 0.224159 -0.266791
C  1.286186 1.341493 -0.058834
C  -1.15206 1.575376 -0.045572
C  -0.138858 -0.660467 -0.508209
C  2.516446 2.174601 0.144107
C  -2.201139 2.627776 0.157184
C  2.388889 -0.897623 -0.335245
C  -2.692362 -0.360839 -0.344108
C  4.480158 -1.383684 -1.533893
C  -4.056269 -2.271838 0.373279
C  5.610618 -0.925791 -0.608073
C  -5.054117 -1.754277 1.412657
H  2.515648 2.61987 1.155669
H  2.536472 3.005178 -0.584037
H  3.42417 1.570849 0.009749
H  -2.165592 3.009021 1.194473
H  -3.201222 2.228597 -0.0586
H  -2.008911 3.482879 -0.514828
H  4.194848 -2.430995 -1.333786
H  4.733719 -1.253818 -2.59775
H  -4.460589 -2.19338 -0.650919
H  -3.735661 -3.304732 0.580007
H  5.857472 0.137284 -0.776626
H  6.519041 -1.522882 -0.81069
H  5.335382 -1.071865 0.44991
H  -4.61059 -1.7662 2.423193
H  -5.949563 -2.403219 1.421882
H  -5.375899 -0.727039 1.172559
