program: Gaussian 09
title: 000222215
version: EM64L-G09RevD.01
frameworkgroup: C1[X(C15H28O6)]
method: RPBEPBE
basis: SDD
operation: Freq
keyword: #pfreq=noraman
keyword: PBEPBE/SDD
title: #p freq=noraman PBEPBE/SDD
converged: YES YES NO NO
title: Mulliken charges:
elementType: O O O O O O C C C C C C C C C C C C C C C H H H H H H H H H H H H H H H H H H H H H H H H H H H H
charge: -0.270907 -0.224705 -0.281151 -0.235694 -0.214052 -0.283424 -0.343421 -0.369273 -0.355768 -0.366628 -0.330650 -0.360495 -0.282469 -0.693786 -0.273938 -0.697030 -0.277094 -0.099213 0.256633 -0.703759 0.328287 0.189368 0.197174 0.232135 0.215133 0.200863 0.199353 0.201777 0.199692 0.227427 0.230239 0.186233 0.228118 0.248252 0.175647 0.209194 0.212831 0.219244 0.194436 0.217132 0.214504 0.262791 0.212130 0.208662 0.211272 0.264484 0.247188 0.228829 0.244429
chargesum: 0.00000
title: Mulliken charges with hydrogens summed into heavy atoms:
elementType: O O O O O O C C C C C C C C C C C C C C C
charge: -0.270907 -0.224705 -0.281151 -0.235694 -0.214052 -0.283424 0.043122 0.077995 0.044447 0.034841 0.127016 0.053856 0.141431 -0.052516 0.137629 -0.064966 0.200201 0.165270 0.256633 0.016687 0.328287
polarizability: 2.21710928e+02 -1.40444862e+00 1.85843283e+02 -1.70911998e+00 1.35347349e+00 1.49337218e+02
1716.lowfreq: -23.9305 -6.1241 -0.9560 -0.0007 -0.0006 -0.0006 9.4507 17.4603 22.2538
frequency: -17.6545 15.7562 21.8821 28.8980 34.6612 39.4012 50.7888 59.3131 70.4004 86.2894 90.6571 100.6452 111.2110 116.6762 121.2685 136.6970 149.7914 157.3996 180.7819 217.4001 231.8440 232.0845 237.1058 263.0312 278.6259 296.8447 306.6886 321.5844 329.8374 357.0814 362.4071 393.1021 434.4059 473.4801 484.8714 564.0595 649.7695 660.4178 689.4220 704.1845 731.3255 745.5678 764.6283 774.0114 809.0395 819.4338 833.8051 841.5864 861.0887 880.6264 900.5446 903.5030 932.8377 939.5260 970.5681 999.1506 1005.4049 1015.2008 1034.8564 1041.9691 1059.8686 1068.1218 1073.4199 1074.9732 1084.6861 1097.5981 1109.7242 1119.2465 1127.4928 1138.2972 1145.0752 1167.0979 1201.5263 1209.9432 1214.0570 1224.7293 1252.2628 1263.6531 1269.4099 1280.1110 1282.0966 1288.5048 1291.0766 1292.2403 1295.4277 1320.1561 1323.9723 1351.5424 1352.3549 1352.9306 1357.3694 1373.6432 1384.3019 1389.9664 1390.5840 1392.4653 1437.4963 1447.7362 1453.6543 1463.7055 1464.4228 1468.9853 1471.8582 1475.1288 1475.9112 1477.1368 1479.4488 1480.0125 1487.5050 1488.3422 1498.7644 1608.3651 1661.0727 2931.9493 2954.5675 2957.5353 2966.7194 2970.5071 2971.2805 2972.4302 2985.8955 2995.8323 2998.7649 3005.7492 3011.8319 3018.3548 3022.7412 3026.2116 3035.0578 3043.1373 3051.4124 3055.8746 3057.1296 3064.5883 3068.5726 3070.2952 3073.5435 3094.5804 3109.6304 3111.3917 3115.1918
redmass: 2.0892 3.6133 3.5416 5.9466 3.3483 2.8132 3.6507 2.4271 3.1238 5.8512 3.9930 4.1717 3.0091 2.0563 1.9524 3.6426 3.1872 3.7398 3.1768 1.1760 1.1138 4.4162 1.1396 3.4020 3.6911 2.7241 3.7154 5.8941 3.1099 5.6964 3.5085 3.9261 3.0385 3.6708 2.2570 4.7542 5.6468 5.3960 5.5080 9.4372 1.0715 1.0718 1.1267 3.3958 1.1406 3.6610 2.7069 2.7828 2.0836 2.7725 1.9677 1.9946 2.7576 1.1701 1.2020 2.9706 2.6240 3.5966 3.2307 2.6574 2.7679 3.5145 2.8143 2.7522 2.2891 2.9589 3.4575 2.4995 2.6514 2.1978 1.4557 1.8077 4.2760 1.3770 1.3825 1.1445 1.2743 1.1690 1.2028 1.1743 1.1866 1.0602 1.1228 1.4403 1.1960 1.3269 1.3225 1.4179 1.3771 1.5161 1.3143 1.3574 1.2506 1.2150 1.2311 1.3190 1.0916 1.0872 1.1057 1.0461 1.0649 1.0761 1.0792 1.0461 1.0534 1.0455 1.0635 1.0530 1.0857 1.0848 1.0869 9.2562 10.0881 1.0665 1.0631 1.0582 1.0369 1.0609 1.0579 1.0374 1.0596 1.0605 1.0976 1.0348 1.0601 1.0967 1.0605 1.1024 1.0961 1.0970 1.0857 1.1009 1.1029 1.1000 1.1011 1.1014 1.0991 1.1065 1.1072 1.1003 1.1013
irintensity: 0.4194 0.0383 0.1141 2.7614 0.2402 0.6003 0.3186 0.4621 1.2197 0.3412 1.1041 0.8779 1.6928 2.1013 0.1080 1.5406 1.9136 0.9032 2.8090 0.2797 0.0749 4.3991 0.0851 0.6452 12.7856 3.3952 1.7228 13.7463 2.4764 31.3141 3.4569 1.4637 4.3205 2.4895 12.0498 0.3239 4.5254 4.4070 5.3336 21.6161 15.8867 8.3331 0.5829 1.4026 0.0512 4.8494 4.1739 42.2999 19.6172 35.3658 28.0693 8.4019 23.6217 0.3051 0.5741 34.1169 5.0675 15.8045 3.0664 23.7574 37.9713 62.9099 248.9264 45.1462 36.5890 34.7068 122.3821 20.9380 3.9908 101.5466 17.2971 6.1693 639.4980 1.6899 1.3292 5.3064 5.0692 7.7709 3.0388 5.2823 17.0418 1.0396 4.1590 14.9303 8.9971 8.0353 25.3342 2.7882 5.8045 1.0918 17.8953 3.3900 10.4688 22.7233 7.8968 3.5048 6.1739 17.9023 14.5321 14.9667 0.8689 0.7875 2.0225 2.8448 17.0134 7.4184 6.2666 13.1493 34.3624 1.4883 6.7379 282.6258 142.3158 42.9726 65.2800 9.5820 37.1950 6.4190 68.7661 30.1503 46.0433 16.2617 3.0913 12.6682 29.4185 1.2529 40.8572 27.5114 0.8617 46.1909 4.6722 4.4152 19.2071 64.7186 195.7917 31.0797 49.7404 11.5356 32.5439 15.1748 14.8653
temp: 298.150 k
press: 1.00000 atm
elementType: 8 8 8 8 8 8 6 6 6 6 6 6 6 6 6 6 6 6 6 6 6 1 1 1 1 1 1 1 1 1 1 1 1 1 1 1 1 1 1 1 1 1 1 1 1 1 1 1 1
symmnumber: 1
zpe: 1091985.3 jmol-1
zpe.correction: 0.415915 hartree
zpe.thermalcorrener: 0.441375 hartree
zpe.thermalcorrenthalpy: 0.442319 hartree
zpe.thermalcorrgfe: 0.356482 hartree
zpe.sumelectzpe: -1038.011657 hartree
zpe.sumelectthermal: -1037.986197 hartree
zpe.sumelectthermalent: -1037.985253 hartree
zpe.sumelectthermalfe: -1038.071090 hartree
dipole: -1.0106 -0.0673 -1.6894
dipole: 1.9698
quadrupole: -102.9852 -134.9855 -130.2319
quadrupole: -5.0796 0.1842 2.0015
quadrupole: 19.7490 -12.2513 -7.4977 -5.0796 0.1842 2.0015
hfenergy: -1038.4275722 hartree
pointgroup: C01 [X(C15H28O6)]
dipole: -0.176307 -0.1041046 -0.7474397 debye
polarizability: 200.9677279|16.3901223|200.7474867|7.0129762|17.4017599|155.1762147 unknown
InChI: InChI=1S/C15H28O6/c1-4-6-8-10-20-15(17)21-13(3)14(16)19-12-11-18-9-7-5-2/h13H,4-12H2,1-3H3
charge 0 multiplicity 1
49 atoms
O  -3.700663 0.237685 0.215998
O  2.662754 -1.257556 -0.885177
O  -2.513247 -2.552223 -0.883381
O  1.092395 -2.782291 -1.323716
O  -0.855361 -2.684931 0.770415
O  0.483372 -0.517721 -1.355558
C  3.134057 2.070575 1.052162
C  2.708681 0.607031 0.783479
C  2.731326 2.550609 2.465345
C  -2.116034 2.050006 -0.045216
C  3.082156 0.162729 -0.63475
C  -1.025636 2.725429 -0.91081
C  -2.66848 0.779918 -0.697136
C  3.12765 4.018104 2.734275
C  -4.341347 -0.989239 -0.242685
C  -0.411402 3.963217 -0.221602
C  -3.581543 -2.268733 0.127421
C  -0.322959 -3.122634 -1.620641
C  -1.213738 -2.752367 -0.421455
C  -0.340218 -4.631412 -1.890425
C  1.337029 -1.423126 -1.192305
H  4.232234 2.176312 0.92952
H  2.6656 2.737484 0.298602
H  1.614198 0.515335 0.916425
H  3.18906 -0.067649 1.517529
H  3.201624 1.891877 3.223112
H  1.635477 2.432454 2.587933
H  -1.694843 1.780548 0.943228
H  -2.949148 2.755622 0.141865
H  2.606755 0.809115 -1.395115
H  4.172843 0.13097 -0.787414
H  -1.46228 3.025739 -1.885593
H  -0.233922 1.984293 -1.13578
H  -1.856889 0.046372 -0.857623
H  -3.136815 1.008234 -1.681291
H  4.221353 4.158235 2.642556
H  2.63966 4.699266 2.011429
H  2.830787 4.336231 3.750355
H  -4.530671 -0.967703 -1.337857
H  -5.316136 -1.019537 0.280243
H  -4.256012 -3.143993 0.095532
H  -3.117936 -2.177703 1.125101
H  0.071908 3.683952 0.734629
H  0.35194 4.445137 -0.860793
H  -1.187131 4.718675 0.005948
H  -0.663027 -2.542951 -2.496351
H  0.016162 -5.18443 -1.005508
H  -1.365807 -4.957351 -2.13348
H  0.319627 -4.864801 -2.742241
