program: Gaussian 09
title: 000222199
version: EM64L-G09RevD.01
frameworkgroup: C1[X(C10H16O4)]
method: RPBEPBE
basis: SDD
operation: Freq
keyword: #pfreq=noraman
keyword: PBEPBE/SDD
title: #p freq=noraman PBEPBE/SDD
converged: YES YES NO NO
title: Mulliken charges:
elementType: O O O O C C C C C C C C C C H H H H H H H H H H H H H H H H
charge: -0.272533 -0.272535 -0.268614 -0.268617 0.401313 0.401325 -0.539926 -0.539925 -0.394842 -0.394835 -0.432666 -0.432666 -0.307012 -0.307013 0.258676 0.226736 0.226735 0.258676 0.228304 0.219738 0.219737 0.228303 0.226628 0.220335 0.220334 0.226629 0.225840 0.208017 0.208019 0.225838
chargesum: 0.00000
title: Mulliken charges with hydrogens summed into heavy atoms:
elementType: O O O O C C C C C C C C C C
charge: -0.272533 -0.272535 -0.268614 -0.268617 0.401313 0.401325 -0.054515 -0.054514 0.053201 0.053205 0.014297 0.014297 0.126845 0.126844
polarizability: 1.44477705e+02 1.19677663e+00 1.05230633e+02 3.05050394e+00 1.54375990e+00 9.40254974e+01
1716.lowfreq: -6.5870 -0.0008 -0.0004 0.0002 13.2117 19.3648 54.4528 57.5524 72.3070
frequency: 54.4528 57.5524 72.1969 131.9526 157.5489 207.8022 232.6445 246.1591 276.7925 293.4019 366.9574 407.6076 462.4878 474.4759 518.2518 523.2744 597.4050 597.7567 651.0082 722.9742 730.4230 737.6491 767.4379 770.5400 829.0480 835.8074 873.0503 880.9514 913.2837 914.0828 960.8099 964.2358 976.2338 978.4350 1004.7473 1011.3584 1033.2027 1041.8427 1074.5233 1077.5816 1116.2387 1132.7056 1134.9273 1141.4677 1182.2709 1184.2064 1207.6572 1211.2242 1242.5540 1243.1970 1250.0599 1264.6808 1292.9930 1298.9470 1309.4844 1313.8480 1331.9694 1332.3335 1361.2173 1363.0576 1435.8460 1436.7421 1458.1915 1458.5173 1468.2052 1468.3137 1478.7418 1478.7473 2989.6063 2989.6741 2999.7201 3000.2128 3017.1403 3017.1925 3030.3662 3030.4788 3077.8819 3077.9170 3095.3384 3095.3836 3098.8895 3099.1434 3104.5095 3104.6924
redmass: 2.6877 4.3208 2.5677 2.7525 4.1834 2.5370 2.2968 2.4978 3.2538 2.9475 2.3681 2.6912 6.0093 6.4173 4.7623 5.6016 2.1002 2.0674 5.6999 3.6775 4.9592 4.1613 3.0904 3.2973 1.6727 1.9305 1.8749 1.8294 3.0232 2.8514 3.5799 3.6847 4.5726 3.7126 1.7626 2.4251 3.1044 2.0263 2.7969 2.2087 3.4126 1.9426 1.5491 2.1729 1.3581 1.3797 1.4075 1.4516 1.2791 1.3222 1.2288 1.3773 1.5001 1.3807 1.3365 1.3876 1.3309 1.3656 1.3412 1.4618 1.0858 1.0862 1.0810 1.0804 1.0873 1.0875 1.0988 1.0993 1.0655 1.0656 1.0634 1.0626 1.0596 1.0596 1.0628 1.0629 1.1030 1.1030 1.1016 1.1016 1.1013 1.1011 1.1047 1.1046
irintensity: 2.2836 3.5492 0.0000 1.5340 0.0000 0.0000 18.9735 13.1436 0.0000 0.0000 4.4537 0.0000 0.0000 13.9223 15.8860 0.0000 0.0018 6.0451 0.0000 21.2852 0.0000 46.8800 81.8878 0.0005 0.0000 103.6955 0.0000 21.6786 0.0002 22.7331 0.0000 263.0194 0.0000 31.7009 0.0000 86.6971 0.0000 8.9659 75.1378 0.0001 0.0000 26.6865 0.0000 49.2532 19.9043 0.0000 0.0000 1.6028 7.0903 0.0001 0.0000 48.7218 38.9961 0.0000 0.0000 5.9518 5.1177 0.0000 1.6829 0.0000 15.2723 0.0000 12.0593 0.0000 0.0001 22.8461 0.3061 13.7215 105.0713 0.1598 0.0000 72.4335 56.7460 0.0125 64.1900 0.0062 24.0681 0.0034 37.6677 0.0093 16.1334 0.0005 0.0028 99.7623
temp: 298.150 k
press: 1.00000 atm
elementType: 8 8 8 8 6 6 6 6 6 6 6 6 6 6 1 1 1 1 1 1 1 1 1 1 1 1 1 1 1 1
symmnumber: 1
zpe: 663056.8 jmol-1
zpe.correction: 0.252545 hartree
zpe.thermalcorrener: 0.265097 hartree
zpe.thermalcorrenthalpy: 0.266041 hartree
zpe.thermalcorrgfe: 0.213512 hartree
zpe.sumelectzpe: -690.413745 hartree
zpe.sumelectthermal: -690.401193 hartree
zpe.sumelectthermalent: -690.400249 hartree
zpe.sumelectthermalfe: -690.452777 hartree
dipole: -0.0001 0.0000 -0.0001
dipole: 0.0002
quadrupole: -64.8611 -80.3085 -88.4595
quadrupole: 3.0244 -0.4870 4.6110
quadrupole: 13.0153 -2.4321 -10.5832 3.0244 -0.4870 4.6110
hfenergy: -690.6662898 hartree
pointgroup: C01 [X(C10H16O4)]
dipole: 0.000045 0.0000142 0.0000416 debye
polarizability: 144.5383513|-0.9013565|102.7637|2.5302427|-4.9547194|96.4317842 unknown
InChI: InChI=1S/C10H16O4/c1-3-9(11-5-1)7-14-10(8-13-9)4-2-6-12-10/h1-8H2
charge 0 multiplicity 1
30 atoms
O  0.744739 -0.35472 -1.184809
O  -0.744592 0.355097 1.184696
O  2.028008 1.026188 0.329292
O  -2.027906 -1.025771 -0.3294
C  1.42617 -0.297193 0.128096
C  -1.426026 0.297589 -0.128211
C  2.597906 -1.309229 0.035402
C  -2.59773 1.309659 -0.035511
C  -0.41108 0.557814 -1.248961
C  0.411221 -0.557444 1.248838
C  3.886964 -0.434725 0.027315
C  -3.886811 0.435183 -0.027247
C  3.355569 0.968842 -0.334582
C  -3.355412 -0.968403 0.334582
H  2.478719 -1.882762 -0.898142
H  2.585714 -2.018323 0.880734
H  -2.585593 2.018663 -0.88092
H  -2.478455 1.883289 0.897961
H  -0.869077 0.376488 -2.233864
H  -0.058549 1.604424 -1.168982
H  0.058688 -1.604051 1.168832
H  0.869211 -0.376142 2.233749
H  4.345385 -0.414368 1.031442
H  4.639868 -0.799362 -0.69227
H  -4.639604 0.799835 0.692447
H  -4.345377 0.414849 -1.031307
H  3.946792 1.804934 0.070177
H  3.231884 1.087238 -1.42922
H  -3.231638 -1.08682 1.429207
H  -3.946687 -1.804475 -0.070143
