program: Gaussian 09
title: 000222198
version: EM64L-G09RevD.01
frameworkgroup: C1[X(C10H14Br2O4)]
method: RPBEPBE
basis: SDD
operation: Freq
keyword: #p
keyword: freq=noraman
keyword: PBEPBE/SDD
title: #p freq=noraman PBEPBE/SDD
converged: YES YES NO NO
title: Mulliken charges:
elementType: Br Br O O O O C C C C C C C C C C H H H H H H H H H H H H H H
charge: 0.057712 0.057617 -0.252196 -0.251914 -0.177743 -0.177654 -0.282586 -0.282587 -0.437785 -0.437356 0.288019 0.288192 -0.253705 -0.253722 -0.660884 -0.661110 0.265042 0.282607 0.264774 0.282509 0.239591 0.223839 0.239335 0.223866 0.219433 0.231147 0.257268 0.219411 0.231198 0.257684
chargesum: 0.00000
title: Mulliken charges with hydrogens summed into heavy atoms:
elementType: Br Br O O O O C C C C C C C C C C
charge: 0.057712 0.057617 -0.252196 -0.251914 -0.177743 -0.177654 -0.282586 -0.282587 0.109863 0.109927 0.288019 0.288192 0.209726 0.209479 0.046964 0.047182
polarizability: 1.71939068e+02 1.33091006e+00 1.65499484e+02 -2.47970014e-02 -5.88894056e-02 1.23893696e+02
1716.lowfreq: -8.1330 0.0001 0.0003 0.0003 6.1955 11.6438 15.5471 22.6220 42.1496
frequency: 14.3785 22.2892 42.1466 45.3959 55.5581 86.5408 93.8326 108.8207 113.7742 144.7297 164.7508 166.7299 173.1245 206.4040 219.4071 236.9467 268.7504 296.2337 305.9738 308.2580 337.0083 417.5407 432.9989 452.9278 536.3919 557.6639 603.6683 704.0976 713.4305 714.7940 755.9513 764.4866 812.0108 813.9376 820.1361 831.8797 940.4395 946.5896 996.0198 1013.3088 1042.6478 1057.5825 1060.8095 1066.0232 1095.1766 1096.1421 1096.2164 1155.8194 1156.3169 1177.7182 1179.7961 1225.1909 1254.9649 1260.7673 1274.3702 1274.5244 1350.0479 1350.6075 1391.5016 1391.9344 1448.7855 1455.7866 1456.6434 1457.1318 1462.7567 1462.9393 1484.4142 1484.4602 1637.5621 1651.9836 2994.6059 2994.6832 3031.4174 3031.4620 3053.3731 3054.3542 3089.8648 3090.0273 3095.9332 3096.2487 3121.8704 3122.1220 3132.7681 3143.0243
redmass: 3.8335 4.1730 5.3260 3.0813 4.5382 6.6968 4.9020 7.7564 4.8280 6.4832 2.4501 7.0990 9.4662 1.5534 1.4118 3.2217 3.9113 2.1064 2.8911 3.0858 8.2888 3.5703 3.5241 6.3356 5.7379 3.7753 5.9214 8.1370 2.7395 4.6685 1.8746 2.5996 2.6174 1.3233 1.7227 2.2998 3.6080 2.5503 2.6098 3.2223 2.8232 4.9718 5.3072 5.8829 1.6647 1.6125 2.1545 1.7030 1.6691 1.2584 4.1751 1.8793 1.5712 2.8501 1.1188 1.1183 1.2702 1.2817 1.2267 1.2262 1.0767 1.1063 1.0900 1.0895 1.0444 1.0449 1.0514 1.0513 10.8475 10.9593 1.0361 1.0361 1.0596 1.0597 1.0588 1.0656 1.0975 1.0975 1.1031 1.1030 1.1063 1.1063 1.1052 1.1050
irintensity: 0.7679 1.8185 0.1469 0.8511 0.2907 1.0666 0.0055 0.2329 0.6231 0.0001 1.1619 4.1349 0.1209 0.9158 1.8858 0.5435 2.9338 0.2450 21.4175 0.3016 20.1771 7.7476 0.2792 14.4065 63.2730 0.6135 0.5878 1.5238 5.3447 3.5667 10.7866 16.0440 2.2652 9.3623 0.5989 5.2529 97.8425 4.5866 10.3555 210.1699 0.9862 0.1696 125.0210 4.9968 130.4735 10.7587 0.4744 80.2926 6.7116 2.1518 377.9394 3.6216 0.0897 6.6867 3.6875 2.9436 0.9881 0.7975 26.1456 23.2272 13.7903 13.0834 15.6200 14.0000 12.7306 14.0118 15.0787 10.0465 52.2175 202.5790 22.7054 10.3281 45.8729 8.9181 10.9781 3.0336 37.4606 26.7127 0.8335 0.8007 27.5552 29.1579 5.5847 8.5638
temp: 298.150 k
press: 1.00000 atm
elementType: 35 35 8 8 8 8 6 6 6 6 6 6 6 6 6 6 1 1 1 1 1 1 1 1 1 1 1 1 1 1
symmnumber: 1
zpe: 593657.0 jmol-1
zpe.correction: 0.226112 hartree
zpe.thermalcorrener: 0.245122 hartree
zpe.thermalcorrenthalpy: 0.246067 hartree
zpe.thermalcorrgfe: 0.174554 hartree
zpe.sumelectzpe: -716.003337 hartree
zpe.sumelectthermal: -715.984327 hartree
zpe.sumelectthermalent: -715.983383 hartree
zpe.sumelectthermalfe: -716.054895 hartree
dipole: -0.0025 -0.0218 3.1593
dipole: 3.1594
quadrupole: -84.8401 -111.4713 -117.2461
quadrupole: 7.9801 -0.0145 0.0795
quadrupole: 19.6791 -6.9521 -12.7270 7.9801 -0.0145 0.0795
hfenergy: -716.2294493 hartree
pointgroup: C01 [X(C10H14Br2O4)]
dipole: 0.0019614 -1.2426182 -0.0310932 debye
polarizability: 172.1177858|-0.0439525|123.9392029|0.7661936|-1.3735916|165.2752596 unknown
InChI: InChI=1S/C10H14Br2O4/c1-3-15-7(13)9(11)5-6-10(9,12)8(14)16-4-2/h3-6H2,1-2H3
charge 0 multiplicity 1
30 atoms
Br 0.678221 -0.388812 -2.316543
Br -0.680881 -0.539429 2.296521
O  2.999834 -0.649286 0.381139
O  -3.006383 -0.631264 -0.39476
O  1.690481 1.281814 0.565579
O  -1.69613 1.305948 -0.484221
C  0.73234 -0.831533 -0.305554
C  -0.733506 -0.852821 0.261454
C  0.782456 -2.380782 -0.130784
C  -0.777644 -2.387734 -0.013309
C  1.817202 0.080055 0.261304
C  -1.821894 0.089393 -0.245217
C  4.204367 0.123815 0.830626
C  -4.213339 0.166509 -0.791256
C  4.854715 0.839351 -0.355817
C  -4.84678 0.826278 0.43606
H  1.283686 -2.640469 0.81591
H  1.240254 -2.943893 -0.954052
H  -1.278488 -2.587903 -0.97453
H  -1.23244 -3.004966 0.77191
H  3.886877 0.837361 1.611227
H  4.857335 -0.651136 1.261962
H  -3.902757 0.916074 -1.540254
H  -4.874369 -0.584525 -1.251554
H  5.785848 1.334826 -0.023851
H  5.109136 0.12358 -1.156171
H  4.182415 1.611072 -0.766125
H  -5.778259 1.342866 0.139051
H  -5.097365 0.073437 1.20293
H  -4.165332 1.572974 0.876424
