program: Gaussian 09
title: 000222197
version: EM64L-G09RevD.01
frameworkgroup: C1[X(C10H11NO3)]
method: RPBEPBE
basis: SDD
operation: Freq
keyword: #p
keyword: freq=noraman
keyword: PBEPBE/SDD
title: #p freq=noraman PBEPBE/SDD
converged: YES YES NO NO
title: Mulliken charges:
elementType: O O O N C C C C C C C C C C H H H H H H H H H H H
charge: -0.254916 -0.200320 -0.228889 0.006659 -0.603336 0.140519 0.281657 0.255864 -0.254776 -0.258407 -0.436013 -0.663225 -0.173744 -0.334146 0.260031 0.262889 0.226102 0.239364 0.286840 0.262138 0.218732 0.249396 0.225896 0.240497 0.251190
chargesum: 0.00000
title: Mulliken charges with hydrogens summed into heavy atoms:
elementType: O O O N C C C C C C C C C C
charge: -0.254916 -0.200320 -0.228889 0.006659 -0.080416 0.140519 0.281657 0.255864 0.210689 0.028433 -0.173875 0.030798 0.066753 -0.082956
polarizability: 1.75439081e+02 5.33689695e+00 1.11915143e+02 4.61413154e+00 -7.16320972e-01 7.64246038e+01
1716.lowfreq: -27.3848 -8.6178 -3.3138 -0.0007 -0.0003 -0.0002 15.7560 33.8826 40.6399
frequency: -13.2828 32.6787 40.4290 58.2566 79.4145 134.8885 147.8597 171.1145 209.2010 284.2240 302.0727 358.2356 363.9452 406.1654 433.0326 446.2993 560.7397 579.6602 606.7797 630.3851 713.0244 714.5639 752.6449 806.7702 821.2482 824.1128 899.7181 916.8242 944.9495 968.2640 980.4568 1007.7535 1011.1674 1021.5929 1034.4009 1095.3315 1104.8925 1122.4372 1157.1448 1193.4732 1225.0429 1241.7476 1276.2919 1297.1564 1311.8840 1335.6592 1354.9998 1387.1844 1405.9956 1423.6935 1457.0032 1461.1967 1462.4806 1484.5357 1545.2535 1576.7361 1603.8933 1653.5572 2992.5610 3012.5056 3033.4509 3079.2734 3087.8013 3094.2561 3121.1930 3134.6536 3138.7431 3154.6965 3174.0710
redmass: 3.2573 4.5347 3.7390 4.8792 5.7045 5.2838 4.8358 6.2039 1.2093 2.3383 4.6474 2.5883 3.4068 3.9409 3.2636 6.6179 9.2260 3.2789 7.1907 4.5870 6.2688 1.9621 2.6651 1.3691 2.5172 2.4838 3.8482 1.5344 1.9600 1.6125 4.2531 3.2355 1.4634 3.4992 2.5334 2.1610 1.5859 1.7720 1.6768 1.4275 1.8244 2.0654 1.1373 2.0184 10.0713 1.3071 1.2990 1.2338 1.9511 1.1651 1.0922 2.0116 1.0448 1.0516 5.5903 5.8956 8.8114 9.6617 1.0358 1.0591 1.0595 1.1009 1.0975 1.1027 1.1067 1.0891 1.0908 1.0915 1.1003
irintensity: 0.8043 0.6204 1.5902 3.8994 1.9175 3.3801 1.1050 2.6461 5.3070 14.9744 2.9744 2.8757 3.1469 1.9116 2.4608 1.0182 13.3268 3.3997 1.1137 23.4680 2.4213 36.5308 4.3887 11.2533 12.2569 19.6491 50.3561 0.3506 1.6123 2.9829 50.1504 13.3160 2.1034 77.1094 5.4318 25.7092 20.5827 142.4253 10.8294 3.3680 148.5878 115.3527 17.6546 219.0113 3.6825 12.6418 6.1588 21.8952 39.0092 26.5731 12.8002 2.2189 14.3271 12.9353 7.6335 85.6365 77.4743 197.5657 20.4827 11.6371 23.8663 1.6271 34.1808 2.3020 29.9266 25.3499 2.6105 3.9781 19.9209
temp: 298.150 k
press: 1.00000 atm
elementType: 8 8 8 7 6 6 6 6 6 6 6 6 6 6 1 1 1 1 1 1 1 1 1 1 1
symmnumber: 1
zpe: 505204.9 jmol-1
zpe.correction: 0.192422 hartree
zpe.thermalcorrener: 0.205252 hartree
zpe.thermalcorrenthalpy: 0.206196 hartree
zpe.thermalcorrgfe: 0.151245 hartree
zpe.sumelectzpe: -667.045945 hartree
zpe.sumelectthermal: -667.033115 hartree
zpe.sumelectthermalent: -667.032171 hartree
zpe.sumelectthermalfe: -667.087122 hartree
dipole: -0.7791 -0.0116 -1.9938
dipole: 2.1406
quadrupole: -64.5510 -83.9421 -87.8330
quadrupole: -9.2742 -6.4406 -1.8999
quadrupole: 14.2244 -5.1667 -9.0576 -9.2742 -6.4406 -1.8999
hfenergy: -667.2383671 hartree
pointgroup: C01 [X(C10H11N1O3)]
dipole: -0.3003347 0.1737974 0.7673881 debye
dipolederiv: -1.2344552 0.0044149 -0.3998743 0.1515392 -0.2954677 0.0117134 -0.5900844 -0.0446742 -0.9243947 -0.8193009 0.111132 0.0293388 0.2099982 -0.7346699 0.0634926 0.0186801 0.0822539 -0.2892611 -0.697828 0.0621726 0.2196333 0.1032178 -0.3074979 -0.1830362 -0.1079388 -0.0702363 -0.909395 -0.571636 -0.0493306 0.0467268 -0.0819038 -0.3071873 0.0235584 0.0589573 0.0202722 -0.2573753 -0.6605202 -0.1041835 0.0954636 -0.3450225 -0.2070647 0.0964579 0.1608736 0.0773302 0.0226365 1.778305 -0.0346878 -0.1666393 0.2042221 0.8492488 -0.1517896 -0.2467937 -0.1461488 0.1946474 -0.7908766 0.0962108 0.069725 -0.1305057 -0.2146296 0.0609937 0.1197579 0.0379809 -0.007101 1.4903726 -0.1277008 0.0832077 -0.2708472 0.1967173 0.2337411 0.6003965 0.1514758 1.5032376 0.8607201 0.003835 0.1977159 -0.0979929 0.302177 -0.113041 0.0835053 -0.0165254 0.2901065 0.1366979 -0.1161769 -0.0015803 0.1485105 0.0922563 -0.0500628 -0.0573225 -0.0196783 -0.0553223 0.3005363 0.0195055 -0.0451169 0.0022905 0.212419 -0.0590954 -0.0482961 -0.061317 -0.0236538 -0.149351 -0.0725009 -0.0159354 -0.0575983 -0.0514688 0.0796778 0.0193425 0.0347872 0.0277955 -0.1859911 0.1948154 -0.0356979 0.2958862 -0.1064919 -0.0362719 -0.0522956 -0.0246316 -0.0914065 0.3802409 0.0071867 -0.0574335 -0.1302338 0.2051351 -0.0415594 -0.0264892 -0.0602638 -0.0362327 0.0092482 0.0187876 -0.0468714 0.0600229 0.0893572 0.0268515 -0.0724805 0.0483237 0.0146244 0.078843 0.0130207 0.0262141 0.0559414 0.0470523 -0.0621388 0.0368177 -0.0735135 0.0385919 -0.0089834 -0.0176141 -0.0094924 0.0165537 0.0568495 0.0767199 -0.0305317 0.1032099 -0.0945989 -0.0089755 -0.0223991 -0.0391901 0.0245213 -0.0410695 -0.0405034 0.0413749 -0.1183926 0.0396347 0.1385927 0.0614709 -0.0115172 0.0149575 0.0267065 0.024775 -0.0041464 0.018742 0.1394218 0.0088744 -0.0868935 0.0347632 -0.1329078 0.0265315 0.0351225 0.0471821 0.0319401 0.1060253 -0.1687104 0.0655907 -0.0485351 0.065956 0.0607934 0.0053084 -0.0347329 0.0149678 0.1170199 0.1261327 0.008887 -0.0391443 -0.0161095 0.0601434 0.0487532 -0.0054172 0.0793729 -0.0851199 0.1040289 0.0303968 0.0478147 -0.0240023 -0.0602259 -0.1021062 0.0213177 -0.1187192 0.0043945 -0.0085394 -0.0791024 0.0384897 -0.101229 0.0067849 0.0473393 0.0446861 0.0448524 0.1440166 -0.107425 0.013163 0.0279352 0.0347354 0.0936011 0.0050999 0.0236372 0.0085917 0.1317084 unknown
polarizability: 175.5413567|-5.215798|109.654438|-4.3322848|-8.3384262|78.5830326 unknown
InChI: InChI=1S/C10H11NO3/c1-2-14-10(13)6-9(12)8-4-3-5-11-7-8/h3-5,7H,2,6H2,1H3
charge 0 multiplicity 1
25 atoms
O  2.879006 0.339656 0.554647
O  0.286917 -1.510531 0.007198
O  2.816641 -0.041157 -1.750863
N  -3.457197 1.583174 -0.203571
C  0.826049 0.807809 -0.568324
C  -0.132915 -0.339177 -0.195686
C  -1.596447 -0.016376 -0.081843
C  2.262732 0.326708 -0.692409
C  4.279691 -0.187305 0.613352
C  -2.501408 -1.054678 0.270145
C  -2.130462 1.280857 -0.308146
C  5.289284 0.92442 0.315726
C  -3.873174 -0.760437 0.381602
C  -4.304794 0.566708 0.137677
H  0.513837 1.241172 -1.535516
H  0.758757 1.596032 0.203581
H  4.367759 -0.566131 1.643845
H  4.368199 -1.018287 -0.107745
H  -2.103558 -2.05964 0.44506
H  -1.484116 2.122014 -0.583135
H  6.316687 0.538463 0.451311
H  5.189301 1.277082 -0.724443
H  5.149224 1.778812 1.00035
H  -4.599151 -1.533736 0.650222
H  -5.363962 0.837246 0.213965
