program: Gaussian 09
title: 000222193
version: EM64L-G09RevD.01
frameworkgroup: C1[X(C8H14O4)]
method: RPBEPBE
basis: SDD
operation: Freq
keyword: #pfreq=noraman
keyword: PBEPBE/SDD
title: #p freq=noraman PBEPBE/SDD
converged: YES YES NO NO
title: Mulliken charges:
elementType: O O O O C C C C C C C C H H H H H H H H H H H H H H
charge: -0.267248 -0.263829 -0.227468 -0.236530 -0.103061 0.048964 -0.703112 -0.703658 0.311465 0.299445 -0.757676 -0.753212 0.229074 0.286630 0.227447 0.218522 0.219427 0.213872 0.226323 0.232517 0.249149 0.253864 0.247833 0.245682 0.247189 0.258389
chargesum: 0.00000
title: Mulliken charges with hydrogens summed into heavy atoms:
elementType: O O O O C C C C C C C C
charge: -0.267248 -0.263829 -0.227468 -0.236530 0.126013 0.335594 -0.037716 -0.030946 0.311465 0.299445 -0.006830 -0.001951
polarizability: 1.09215377e+02 2.43980641e+00 1.00936497e+02 3.78726286e+00 -9.04679596e-01 8.82410414e+01
1716.lowfreq: -10.7449 -0.0009 -0.0009 -0.0007 2.1953 4.0051 24.5161 51.6391 57.2887
frequency: 24.4587 51.6184 57.2859 70.4558 78.3398 91.6370 100.0468 119.8515 193.4733 212.6792 225.4536 238.8058 258.1688 301.6785 330.6856 391.9402 440.9152 503.3420 556.8107 562.9381 583.2652 599.5563 636.5269 823.2483 831.9034 868.0166 904.0033 919.8106 933.5967 965.5290 984.4898 1001.8281 1013.1537 1042.0067 1042.5932 1117.0450 1139.3117 1179.3147 1200.6576 1207.6752 1297.9570 1315.5735 1348.2074 1350.2362 1377.3312 1383.5884 1383.9737 1398.6380 1451.7845 1453.2445 1454.1582 1454.9942 1464.7176 1473.2208 1479.6763 1494.1127 1657.9118 1670.3677 2982.7573 2990.6247 2994.0376 3006.9784 3007.7178 3044.1869 3077.6258 3085.7689 3090.1744 3095.5716 3097.1253 3099.6060 3142.3334 3143.4048
redmass: 7.0193 1.5000 3.0311 2.6471 2.3178 2.0972 1.3128 3.7058 1.1280 2.6092 4.3185 1.3345 3.6126 2.9196 3.7903 2.5612 3.8994 3.4521 3.1322 3.4808 3.4695 4.4401 5.2830 3.0918 4.7513 5.3342 6.2613 1.4561 1.9069 1.5292 1.9662 1.7920 2.6483 1.6664 1.6670 1.8322 2.3388 2.7823 1.8140 3.7262 1.3051 1.4550 1.3523 1.4382 1.2105 1.2469 1.2453 1.2171 1.0564 1.0572 1.0508 1.0521 1.0462 1.0483 1.0463 1.0617 9.7006 9.9275 1.0357 1.0382 1.0802 1.0378 1.0372 1.0861 1.0992 1.1004 1.0998 1.0997 1.0964 1.0951 1.1021 1.1014
irintensity: 0.4382 2.5034 2.5315 1.0130 1.2733 2.0874 0.7745 1.5489 0.5939 3.5958 5.5932 0.1064 4.0041 2.8632 3.9897 2.9944 12.1751 6.2872 2.2094 8.5815 1.5820 4.4421 6.8333 6.4636 13.4416 64.5198 280.2552 51.6532 36.5576 3.9808 65.6224 0.9466 161.5476 8.1540 10.8972 37.6116 31.6819 272.6937 6.5253 275.7422 0.2753 0.8073 2.8276 1.7125 20.0128 65.3494 52.9531 20.9963 27.1826 23.7057 19.5838 14.1019 6.1108 1.7809 12.1881 21.9851 112.4819 237.9928 28.9445 26.7061 9.1301 1.4538 1.4054 5.5806 31.3033 6.7999 50.1726 38.2330 7.3226 7.5241 9.5061 9.0677
temp: 298.150 k
press: 1.00000 atm
elementType: 8 8 8 8 6 6 6 6 6 6 6 6 1 1 1 1 1 1 1 1 1 1 1 1 1 1
symmnumber: 1
zpe: 553701.9 jmol-1
zpe.correction: 0.210894 hartree
zpe.thermalcorrener: 0.225867 hartree
zpe.thermalcorrenthalpy: 0.226811 hartree
zpe.thermalcorrgfe: 0.167207 hartree
zpe.sumelectzpe: -613.201410 hartree
zpe.sumelectthermal: -613.186437 hartree
zpe.sumelectthermalent: -613.185493 hartree
zpe.sumelectthermalfe: -613.245097 hartree
dipole: 1.6626 0.6114 2.5633
dipole: 3.1159
quadrupole: -64.6806 -70.0221 -76.3061
quadrupole: -0.9924 -5.9353 -5.1804
quadrupole: 5.6556 0.3142 -5.9698 -0.9924 -5.9353 -5.1804
hfenergy: -613.4123038 hartree
pointgroup: C01 [X(C8H14O4)]
dipole: -0.4700986 -0.4436429 1.041614 debye
dipolederiv: -1.3782038 0.5153664 -0.0496185 0.7006094 -0.9783754 0.1543764 0.0067296 0.1016375 -0.3265158 -1.1766078 -0.5615515 0.2007899 -0.7926647 -1.0491395 0.0782388 0.1584278 0.0338822 -0.5017352 -0.5707888 -0.0823345 0.1766549 0.2432884 -0.7373352 0.2500978 -0.0448073 0.3554802 -0.540001 -0.5748089 -0.202145 0.1222006 -0.1035968 -0.4930149 -0.182967 0.3888183 0.0591032 -0.8292099 -0.0096604 -0.0222349 0.003203 -0.0027554 0.0408114 -0.0147784 -0.0428872 -0.0170752 0.1167655 1.3588032 -0.1068605 0.040866 0.2353668 0.8866259 0.0176423 0.1323819 0.3073647 0.2595016 0.0556686 0.0079657 -0.0371458 -0.0641684 -0.0471623 -0.0270357 -0.0507413 0.0029947 -0.0009346 0.0741618 -0.0046408 -0.0258153 -0.0034191 -0.00341 0.0028644 -0.0076104 -0.0077713 -0.0828863 1.3740803 -0.3446893 -0.2499317 -0.8613434 1.2368011 -0.4399569 0.0225675 -0.5688543 0.6378864 1.1208129 0.7987059 -0.3257679 0.7405412 1.0552506 0.1631458 -0.7066734 -0.1390518 1.0845873 -0.3352968 0.0372301 0.1570375 0.0180156 -0.0128332 0.0211541 0.2483269 0.0155231 -0.1147215 -0.0380813 -0.0845037 -0.025244 -0.1731026 -0.2870547 -0.1823053 -0.0605258 -0.1862403 -0.113489 -0.126126 -0.0152879 0.0510751 -0.0052448 0.039423 0.0109554 0.0526732 0.0156592 0.0167421 0.000779 0.0468236 -0.0159945 -0.0285411 0.0180112 0.0573254 -0.0418237 -0.0375944 -0.0270688 -0.1250004 -0.0334632 0.0312292 0.0006523 0.1110888 -0.0188709 0.0821014 0.0023998 0.0615883 0.0813242 -0.016547 0.0003113 -0.0168698 0.0850132 0.0824499 -0.0148119 0.0335149 -0.1638887 0.0431054 0.0909337 -0.0135574 0.0630489 -0.1698744 -0.0007476 -0.0297438 0.0258701 0.0959723 0.0490684 0.1066308 -0.0160915 0.1036637 -0.1536902 0.0672026 0.0006137 0.0283823 0.0710262 -0.1116035 -0.0304545 0.0967831 -0.0122502 0.1137752 0.0046578 0.0403634 -0.0008694 0.0568939 0.0299029 -0.0786807 -0.0722634 -0.0875702 0.0312931 -0.1147351 -0.0671167 -0.091049 -0.0076106 0.0777744 -0.0412012 0.0137024 -0.0786067 -0.0473914 -0.0206535 -0.0225541 -0.0233231 0.1333593 0.0832032 -0.0158341 -0.0465954 0.0092387 0.125082 -0.0384964 -0.0207676 -0.0390412 -0.0449375 0.0103497 0.0662919 -0.0148062 0.0965671 0.0232488 0.0626537 -0.053973 0.0714111 0.0816844 -0.049143 -0.0887262 0.0414297 -0.0570018 0.0921924 -0.0030905 0.0774507 0.0058702 0.0684014 0.1126944 -0.0329156 -0.0206064 0.0128681 0.0951705 0.0845221 -0.0272888 0.0457924 -0.0518187 0.0235921 0.0921228 -0.0218447 0.0632749 0.0254938 -0.0136491 -0.0191294 0.0059844 0.1204086 unknown
polarizability: 105.6214481|4.5136113|104.2714382|-4.3001982|-1.7997567|88.5000291 unknown
InChI: InChI=1S/C8H14O4/c1-5(2)8(11-6(3)9)12-7(4)10/h5,8H,1-4H3
charge 0 multiplicity 1
26 atoms
O  -1.259035 -0.380147 0.281477
O  0.900735 0.502758 0.531529
O  -1.559085 1.589391 -0.947151
O  2.19377 0.928535 -1.369497
C  0.616092 -1.917245 0.004096
C  0.106251 -0.491427 -0.23656
C  -0.176222 -2.914631 -0.874203
C  0.58387 -2.310674 1.49783
C  -2.004543 0.745742 -0.144611
C  1.877928 1.214372 -0.195352
C  -3.357647 0.748645 0.526084
C  2.443719 2.331774 0.648561
H  1.669443 -1.907302 -0.342489
H  0.139115 -0.200705 -1.302944
H  -1.237452 -2.945637 -0.569626
H  -0.129564 -2.642373 -1.945263
H  0.242071 -3.931141 -0.766116
H  1.039938 -3.307275 1.637236
H  -0.455402 -2.35009 1.868629
H  1.140452 -1.583944 2.114715
H  -3.828491 -0.24578 0.453816
H  -3.236399 0.978347 1.599886
H  -4.001103 1.510242 0.06279
H  3.405112 2.665395 0.2314
H  2.565495 2.009962 1.695188
H  1.737654 3.182211 0.639475
