program: Gaussian 09
title: 000222166
version: EM64L-G09RevD.01
frameworkgroup: C1[X(C12H13NO4S)]
method: RPBEPBE
basis: SDD
operation: Freq
keyword: #p
keyword: freq=noraman
keyword: PBEPBE/SDD
title: #p freq=noraman PBEPBE/SDD
converged: YES YES NO NO
title: Mulliken charges:
elementType: S O O O O N C C C C C C C C C C C C H H H H H H H H H H H H H
charge: 0.982893 -0.306320 -0.569722 -0.509085 -0.510062 -0.683111 0.290319 0.459905 0.118136 -0.085875 -0.424852 0.212831 -0.343158 -0.512003 -0.280967 -0.338647 -0.235698 -0.687660 0.290577 0.213823 0.246773 0.280445 0.247624 0.315158 0.345764 0.213616 0.213268 0.214748 0.231354 0.231364 0.378562
chargesum: 0.00000
title: Mulliken charges with hydrogens summed into heavy atoms:
elementType: S O O O O N C C C C C C C C C C C C
charge: 0.982893 -0.306320 -0.191160 -0.509085 -0.510062 -0.022189 0.290319 0.459905 0.118136 -0.085875 -0.134276 0.212831 -0.129335 -0.265230 -0.000522 -0.091023 0.191186 -0.010195
polarizability: 3.28109312e+02 8.45108911e+00 1.81500693e+02 -3.80859268e-01 1.83850144e-01 9.74265268e+01
1716.lowfreq: -10.1801 -7.6119 -3.5134 -0.0019 -0.0009 -0.0006 23.9669 30.9988 64.2003
frequency: 23.6582 30.8893 64.1843 85.8135 99.0527 114.5330 134.2719 136.4858 163.5364 187.5860 221.1129 239.5616 248.3852 267.3480 294.5064 310.5858 318.9559 327.1701 337.0077 366.9691 381.3043 426.5445 429.6107 486.8966 498.9311 517.0734 520.2891 543.8371 554.8412 600.4509 621.2073 676.6718 702.7841 735.4960 764.9068 787.9402 818.1157 823.6098 826.6454 837.4481 874.3391 912.3971 931.3516 940.4801 953.1824 964.1212 1038.7040 1045.0081 1057.9695 1100.0576 1114.0431 1127.1990 1136.5309 1162.6935 1209.2594 1230.7798 1260.1684 1265.1150 1284.5836 1362.9320 1369.8011 1399.1115 1406.1071 1422.4545 1444.7868 1463.2273 1474.9072 1482.9357 1490.7737 1521.5709 1577.0216 1591.3783 1615.9164 1627.7640 2961.0787 2997.0518 3020.7424 3095.1188 3105.1444 3136.9051 3145.8756 3148.3353 3168.1288 3173.3656 3479.8040 3566.7934 3716.9497
redmass: 6.1055 4.4886 5.5822 5.5488 1.9007 2.9523 4.7982 6.4243 1.6537 6.5253 5.1326 3.3243 1.1716 4.1001 4.0620 2.8713 2.0690 4.4973 3.2474 6.9304 6.7780 2.8810 7.9224 6.3178 4.6157 1.6863 1.8597 5.7055 6.7474 4.5674 5.8928 4.1353 5.6346 5.1313 1.8837 1.3766 2.5851 6.5936 1.1183 5.3895 4.4787 1.3428 2.4325 1.5194 1.3872 14.1139 2.6404 1.2273 2.2870 2.5332 2.1323 1.9481 1.4341 1.2338 2.2519 1.7229 1.1431 1.7874 1.9876 1.3385 3.2035 1.2743 3.4081 5.8455 2.8747 1.0402 1.4209 1.6334 1.2701 4.5183 4.3540 6.4401 4.4393 1.5589 1.0554 1.0362 1.1079 1.0989 1.1016 1.0881 1.0881 1.0919 1.0967 1.0960 1.0661 1.0456 1.1029
irintensity: 1.3371 0.6256 0.2682 0.2613 0.8052 9.1154 1.1874 0.6686 49.0717 9.7536 0.9114 24.2141 3.4838 32.8892 42.7910 22.7168 60.9244 27.8163 1.2841 15.2197 5.9311 28.6592 89.1800 1.7622 4.3514 68.9231 119.1395 146.4101 35.2232 3.5040 9.9761 21.8953 24.3175 7.1051 3.9989 66.3260 13.2312 49.3494 1.7158 58.4550 9.1303 10.5956 28.4787 16.3048 3.9745 92.2535 89.9092 60.1117 90.0208 69.5270 14.2787 152.3211 4.8860 11.9408 210.9998 19.1634 0.0021 34.7568 83.0760 21.8213 38.8598 54.8827 8.9307 76.4864 13.1673 12.8306 85.0195 58.5490 4.6026 28.1104 21.4497 29.8172 46.9913 291.6774 45.8578 26.0223 30.9192 27.8670 34.9406 11.8340 5.3638 1.6742 14.7672 7.3773 39.5518 100.6772 33.3376
temp: 298.150 k
press: 1.00000 atm
elementType: 16 8 8 8 8 7 6 6 6 6 6 6 6 6 6 6 6 6 1 1 1 1 1 1 1 1 1 1 1 1 1
symmnumber: 1
zpe: 604713.4 jmol-1
zpe.correction: 0.230323 hartree
zpe.thermalcorrener: 0.248691 hartree
zpe.thermalcorrenthalpy: 0.249635 hartree
zpe.thermalcorrgfe: 0.183272 hartree
zpe.sumelectzpe: -1217.296684 hartree
zpe.sumelectthermal: -1217.278316 hartree
zpe.sumelectthermalent: -1217.277372 hartree
zpe.sumelectthermalfe: -1217.343735 hartree
dipole: -8.2656 1.0517 1.3880
dipole: 8.4470
quadrupole: -105.2398 -101.7199 -120.5617
quadrupole: 4.7770 10.6689 -0.5146
quadrupole: 3.9340 7.4539 -11.3879 4.7770 10.6689 -0.5146
hfenergy: -1217.5270071 hartree
pointgroup: C01[X(C12H13N1O4S1)]
dipole: 3.2676914 0.4642161 -0.388798 debye
polarizability: 327.6171448|-3.3892536|180.4082353|14.187163|-7.8895984|99.0111515 unknown
InChI: InChI=1S/C12H13NO4S/c1-2-17-11-6-3-8-7-9(18(14,15)16)4-5-10(8)12(11)13/h3-7,14H,2,13H2,1H3
charge 0 multiplicity 1
31 atoms
S  -4.266977 -0.337697 -0.056653
O  3.961155 0.324027 0.234704
O  -4.44913 -0.39944 -1.911646
O  -4.524809 -1.822261 0.535409
O  -5.137447 0.919117 0.479001
N  2.206226 2.273869 -0.034303
C  0.283792 0.694211 0.026959
C  -0.150997 -0.690525 0.13852
C  1.693561 0.988332 0.064253
C  -2.449339 0.065823 -0.037137
C  -1.55247 -0.982242 0.097218
C  2.613409 -0.086102 0.210611
C  -0.708515 1.724752 -0.108106
C  0.809837 -1.735614 0.283448
C  -2.071228 1.431904 -0.144561
C  2.175811 -1.43163 0.319036
C  5.003877 -0.709598 0.391221
C  6.350108 0.008922 0.387219
H  -1.906382 -2.015209 0.185629
H  -0.411115 2.776127 -0.185153
H  0.470304 -2.772627 0.366607
H  -2.831108 2.213069 -0.232501
H  2.905093 -2.238886 0.43108
H  1.613243 3.087222 -0.151232
H  3.21603 2.389811 0.002988
H  4.839134 -1.251322 1.344631
H  4.930376 -1.431538 -0.447259
H  7.168645 -0.724521 0.501442
H  6.500753 0.552953 -0.560849
H  6.411417 0.7305 1.21971
H  -5.422957 -0.528225 -2.107386
