program: Gaussian 09
title: 000222162
version: EM64L-G09RevD.01
frameworkgroup: C1[X(C8H13NO2)]
method: RPBEPBE
basis: SDD
operation: Freq
keyword: #p
keyword: freq=noraman
keyword: PBEPBE/SDD
title: #p freq=noraman PBEPBE/SDD
converged: YES YES NO NO
title: Mulliken charges:
elementType: O O N C C C C C C C C H H H H H H H H H H H H H
charge: -0.430531 -0.234169 -0.603689 -0.094909 -0.437299 -0.428156 -0.199535 -0.437736 -0.226998 -0.205898 0.156628 0.240120 0.218937 0.196314 0.208616 0.205468 0.250534 0.214137 0.211690 0.213409 0.205046 0.281692 0.311924 0.384405
chargesum: 0.00000
title: Mulliken charges with hydrogens summed into heavy atoms:
elementType: O O N C C C C C C C C
charge: -0.046126 -0.234169 -0.010073 0.145211 -0.022048 -0.014073 0.050999 -0.011909 -0.013589 -0.000852 0.156628
polarizability: 1.18425836e+02 5.11772879e+00 8.50741584e+01 5.01185951e+00 -2.71421233e+00 8.31741585e+01
1716.lowfreq: -1.9236 -0.0007 0.0002 0.0005 6.3304 22.3262 53.2141 67.3741 76.2814
frequency: 53.1933 66.9150 76.1889 133.4452 204.8805 239.5306 248.3362 272.3417 309.7551 359.8547 421.9794 449.0510 497.2731 520.4039 554.1408 591.1172 633.5826 654.4015 724.6254 742.8966 789.6945 811.9483 860.9325 880.5280 930.3477 942.5665 982.2487 994.0935 1019.5823 1054.0111 1082.6725 1094.5421 1118.5216 1141.8514 1175.2859 1192.2381 1229.2368 1240.7533 1252.3257 1276.2214 1298.3958 1321.7513 1336.4065 1340.3344 1350.5333 1366.0642 1386.6667 1454.4373 1465.5200 1471.3277 1618.9425 1660.4945 1668.3938 2953.9606 2955.0384 2969.8007 2976.4138 2980.3455 3011.0698 3034.0316 3045.4530 3074.2951 3113.8803 3491.6187 3521.1428 3630.3298
redmass: 6.0168 3.6778 3.8058 4.1865 1.6803 3.5714 1.4063 1.9249 4.2741 2.8132 3.1624 2.3663 4.1935 1.5611 2.1865 2.1615 2.1249 2.2192 1.5471 2.9877 2.4609 4.2526 2.9730 1.5886 2.6831 2.2236 1.3010 2.1298 2.0863 2.0664 1.5926 2.0587 1.7339 1.2811 1.2657 1.4042 1.3006 1.2774 1.4078 1.1785 1.9084 1.3173 1.4473 1.5995 1.7395 1.6160 1.5249 1.0900 1.0877 1.0898 1.0980 8.4031 6.9131 1.0651 1.0812 1.0612 1.0843 1.0636 1.0929 1.0982 1.1036 1.0844 1.0976 1.0446 1.0641 1.0998
irintensity: 2.0847 0.4538 1.9133 0.6392 16.0804 1.5644 21.2236 6.3077 2.8911 9.4133 55.3705 5.4193 31.0697 188.1877 138.0318 19.2061 32.4836 167.0043 21.1241 9.1708 5.0567 12.4882 3.6738 5.6276 10.4721 3.8856 5.3691 4.7303 216.5702 26.9557 2.1843 1.4810 46.2257 9.8718 12.3839 0.9599 1.6096 1.1092 1.2655 1.0017 36.4516 6.9118 0.7183 2.5699 2.7992 19.3766 1.0656 10.3281 8.4770 7.9132 66.7268 183.4147 21.0587 31.1684 11.2982 24.6588 37.7674 27.2687 48.4953 42.0398 59.8328 9.4031 49.6185 4.5606 28.8148 16.5942
temp: 298.150 k
press: 1.00000 atm
elementType: 8 8 7 6 6 6 6 6 6 6 6 1 1 1 1 1 1 1 1 1 1 1 1 1
symmnumber: 1
zpe: 528271.9 jmol-1
zpe.correction: 0.201208 hartree
zpe.thermalcorrener: 0.212487 hartree
zpe.thermalcorrenthalpy: 0.213431 hartree
zpe.thermalcorrgfe: 0.163953 hartree
zpe.sumelectzpe: -516.971229 hartree
zpe.sumelectthermal: -516.959950 hartree
zpe.sumelectthermalent: -516.959006 hartree
zpe.sumelectthermalfe: -517.008484 hartree
dipole: 1.8683 -0.8212 1.7950
dipole: 2.7179
quadrupole: -64.6000 -65.2784 -69.0309
quadrupole: 4.6422 -4.1290 -3.8814
quadrupole: 1.7031 1.0247 -2.7278 4.6422 -4.1290 -3.8814
hfenergy: -517.1724367 hartree
pointgroup: C01 [X(C8H13N1O2)]
dipole: 0.714422 -0.3228616 0.7271568 debye
dipolederiv: -0.5780046 -0.0334602 0.3554932 -0.1181495 -0.4079517 0.2986942 0.3692029 0.2008002 -0.9484454 -0.6235216 -0.1509878 -0.2355776 -0.2886657 -0.4608305 -0.2125371 -0.144081 -0.0307528 -0.8742577 -0.6023164 0.3193744 0.0653089 0.3722107 -0.6586477 -0.2490494 0.1278727 -0.1587025 -0.5413269 0.0848297 0.0518877 0.0583591 -0.1146809 -0.0654846 -0.0068663 -0.1401829 -0.0471399 0.0927385 -0.0654865 0.0604311 0.0040698 0.0372939 0.0481547 0.0579982 0.0479543 -0.0136993 0.0811467 0.0329366 -0.0075106 -0.0165256 0.0161015 0.0930669 -0.0218923 -0.0346573 0.0074153 0.1611239 -0.0787831 -0.267875 -0.0121496 -0.3456839 0.2431648 0.1218978 -0.027349 0.2340586 0.5189082 0.0433716 -0.0053339 -0.0577082 -0.0334758 -0.0200145 0.0633421 -0.0967485 0.0898896 0.1335697 -0.0476562 0.0889152 0.0395117 0.2846794 0.0539171 -0.1007311 0.1407729 -0.0668105 -0.175415 0.0285658 0.006256 0.0913937 -0.0943047 0.1153309 -0.158867 0.1421651 -0.1676275 -0.1279535 0.9918428 0.4058562 -0.0337134 0.7489422 0.5477771 -0.0455507 -0.0871623 -0.1260702 1.416158 0.0117297 -0.0082308 -0.0384296 -0.0582878 0.0136346 -0.0675872 -0.0068738 -0.0400941 -0.107276 -0.0595478 -0.1287932 -0.0178511 -0.1241438 -0.081245 -0.0077569 -0.027954 -0.0313606 0.0603132 0.0612713 0.002545 0.0277334 0.0028952 0.0667053 -0.0759924 0.0355395 -0.0115525 -0.1308679 0.0238295 -0.0036971 0.0183278 -0.0072482 0.047028 -0.0456022 0.0572928 -0.1119127 -0.1422249 0.0160737 0.0517313 -0.0290585 0.0695885 -0.1399025 0.1085367 -0.0534829 0.1466708 0.0008756 0.0532903 0.02628 -0.0093013 0.0351009 -0.0464484 0.0736069 -0.033138 0.046988 -0.1111755 -0.1859891 0.0368678 0.0430087 0.0714028 0.0324505 0.0154757 0.0840777 -0.0154893 0.0784184 0.0948529 -0.0100003 0.0079363 0.0395287 0.0195929 -0.0104429 -0.0798455 -0.0169826 -0.1711295 0.0499967 0.0467192 -0.0561593 -0.0006982 -0.1092762 0.112719 -0.045643 0.1092771 0.0805193 -0.0391063 -0.117812 -0.0050071 -0.1183859 -0.0859906 0.0502104 -0.0312088 0.0531819 0.1324925 0.1605359 -0.196924 -0.0706913 -0.149464 0.3246841 0.0369548 -0.0655263 -0.0094457 0.1479786 0.3395377 -0.0588134 -0.0662971 -0.0841437 0.203681 0.1165982 -0.012369 0.0457732 0.1505796 0.2877474 -0.1074256 -0.062673 -0.1404117 0.2666037 -0.0531585 -0.1186556 -0.0864144 0.27525 unknown
polarizability: 117.8949761|5.5618759|85.2787288|6.3195737|-2.4321401|83.5004478 unknown
InChI: InChI=1S/C8H13NO2/c9-7(8(10)11)6-4-2-1-3-5-6/h2,4,6-7,10H,1,3,5,9H2
charge 0 multiplicity 1
24 atoms
O  -2.77511 -0.591962 0.804907
O  -2.713597 -0.593398 -1.51409
N  -1.123655 1.48322 1.030433
C  0.213422 0.118914 -0.716377
C  0.573802 -1.056163 0.223454
C  2.049637 -1.486539 0.057812
C  -1.136708 0.849656 -0.285814
C  3.007557 -0.321776 0.403614
C  1.322674 1.156587 -0.775636
C  2.565138 0.974325 -0.25351
C  -2.275753 -0.149338 -0.430131
H  0.027576 -0.26685 -1.742145
H  -0.097942 -1.914313 0.030794
H  0.404593 -0.740764 1.273502
H  2.224309 -1.800552 -0.990441
H  2.266253 -2.362413 0.698679
H  -1.320176 1.613425 -1.069441
H  4.040357 -0.565476 0.084623
H  3.057293 -0.183344 1.505074
H  1.081125 2.105866 -1.27889
H  3.303981 1.785372 -0.324419
H  -0.276852 2.018813 1.233265
H  -1.461838 0.902631 1.79918
H  -3.499687 -1.255021 0.644954
